Mailing list archives

Site index · List index
Message view « Date » · « Thread »
Top « Date » · « Thread »
From Apache Jenkins Server <jenk...@builds.apache.org>
Subject [JENKINS] Lucene-Solr-NightlyTests-5.4 - Build # 12 - Still Failing
Date Tue, 08 Dec 2015 11:37:44 GMT
Build: https://builds.apache.org/job/Lucene-Solr-NightlyTests-5.4/12/

1 tests failed.
FAILED:  org.apache.solr.cloud.CollectionsAPIDistributedZkTest.test

Error Message:
Captured an uncaught exception in thread: Thread[id=59605, name=collection1, state=RUNNABLE, group=TGRP-CollectionsAPIDistributedZkTest]

Stack Trace:
com.carrotsearch.randomizedtesting.UncaughtExceptionError: Captured an uncaught exception in thread: Thread[id=59605, name=collection1, state=RUNNABLE, group=TGRP-CollectionsAPIDistributedZkTest]
Caused by: org.apache.solr.client.solrj.impl.HttpSolrClient$RemoteSolrException: Error from server at http://127.0.0.1:56037/_pm: collection already exists: awholynewstresscollection_collection1_0
	at __randomizedtesting.SeedInfo.seed([EB19EDDE5315287C]:0)
	at org.apache.solr.client.solrj.impl.HttpSolrClient.executeMethod(HttpSolrClient.java:575)
	at org.apache.solr.client.solrj.impl.HttpSolrClient.request(HttpSolrClient.java:241)
	at org.apache.solr.client.solrj.impl.HttpSolrClient.request(HttpSolrClient.java:230)
	at org.apache.solr.client.solrj.impl.LBHttpSolrClient.doRequest(LBHttpSolrClient.java:372)
	at org.apache.solr.client.solrj.impl.LBHttpSolrClient.request(LBHttpSolrClient.java:325)
	at org.apache.solr.client.solrj.impl.CloudSolrClient.sendRequest(CloudSolrClient.java:1100)
	at org.apache.solr.client.solrj.impl.CloudSolrClient.requestWithRetryOnStaleState(CloudSolrClient.java:871)
	at org.apache.solr.client.solrj.impl.CloudSolrClient.request(CloudSolrClient.java:807)
	at org.apache.solr.client.solrj.SolrClient.request(SolrClient.java:1220)
	at org.apache.solr.cloud.AbstractFullDistribZkTestBase.createCollection(AbstractFullDistribZkTestBase.java:1574)
	at org.apache.solr.cloud.AbstractFullDistribZkTestBase.createCollection(AbstractFullDistribZkTestBase.java:1595)
	at org.apache.solr.cloud.CollectionsAPIDistributedZkTest$1CollectionThread.run(CollectionsAPIDistributedZkTest.java:881)




Build Log:
[...truncated 10815 lines...]
   [junit4] Suite: org.apache.solr.cloud.CollectionsAPIDistributedZkTest
   [junit4]   2> Creating dataDir: /x1/jenkins/jenkins-slave/workspace/Lucene-Solr-NightlyTests-5.4/solr/build/solr-core/test/J0/temp/solr.cloud.CollectionsAPIDistributedZkTest_EB19EDDE5315287C-001/init-core-data-001
   [junit4]   2> 1696265 INFO  (SUITE-CollectionsAPIDistributedZkTest-seed#[EB19EDDE5315287C]-worker) [    ] o.a.s.SolrTestCaseJ4 Randomized ssl (false) and clientAuth (false)
   [junit4]   2> 1696265 INFO  (SUITE-CollectionsAPIDistributedZkTest-seed#[EB19EDDE5315287C]-worker) [    ] o.a.s.BaseDistributedSearchTestCase Setting hostContext system property: /_pm/
   [junit4]   2> 1696271 INFO  (TEST-CollectionsAPIDistributedZkTest.test-seed#[EB19EDDE5315287C]) [    ] o.a.s.c.ZkTestServer STARTING ZK TEST SERVER
   [junit4]   2> 1696271 INFO  (Thread-54234) [    ] o.a.s.c.ZkTestServer client port:0.0.0.0/0.0.0.0:0
   [junit4]   2> 1696271 INFO  (Thread-54234) [    ] o.a.s.c.ZkTestServer Starting server
   [junit4]   2> 1696371 INFO  (TEST-CollectionsAPIDistributedZkTest.test-seed#[EB19EDDE5315287C]) [    ] o.a.s.c.ZkTestServer start zk server on port:43566
   [junit4]   2> 1696371 INFO  (TEST-CollectionsAPIDistributedZkTest.test-seed#[EB19EDDE5315287C]) [    ] o.a.s.c.c.SolrZkClient Using default ZkCredentialsProvider
   [junit4]   2> 1696372 INFO  (TEST-CollectionsAPIDistributedZkTest.test-seed#[EB19EDDE5315287C]) [    ] o.a.s.c.c.ConnectionManager Waiting for client to connect to ZooKeeper
   [junit4]   2> 1696377 INFO  (zkCallback-1072-thread-1) [    ] o.a.s.c.c.ConnectionManager Watcher org.apache.solr.common.cloud.ConnectionManager@78b9e56b name:ZooKeeperConnection Watcher:127.0.0.1:43566 got event WatchedEvent state:SyncConnected type:None path:null path:null type:None
   [junit4]   2> 1696377 INFO  (TEST-CollectionsAPIDistributedZkTest.test-seed#[EB19EDDE5315287C]) [    ] o.a.s.c.c.ConnectionManager Client is connected to ZooKeeper
   [junit4]   2> 1696378 INFO  (TEST-CollectionsAPIDistributedZkTest.test-seed#[EB19EDDE5315287C]) [    ] o.a.s.c.c.SolrZkClient Using default ZkACLProvider
   [junit4]   2> 1696378 INFO  (TEST-CollectionsAPIDistributedZkTest.test-seed#[EB19EDDE5315287C]) [    ] o.a.s.c.c.SolrZkClient makePath: /solr
   [junit4]   2> 1696382 INFO  (TEST-CollectionsAPIDistributedZkTest.test-seed#[EB19EDDE5315287C]) [    ] o.a.s.c.c.SolrZkClient Using default ZkCredentialsProvider
   [junit4]   2> 1696384 INFO  (TEST-CollectionsAPIDistributedZkTest.test-seed#[EB19EDDE5315287C]) [    ] o.a.s.c.c.ConnectionManager Waiting for client to connect to ZooKeeper
   [junit4]   2> 1696385 INFO  (zkCallback-1073-thread-1) [    ] o.a.s.c.c.ConnectionManager Watcher org.apache.solr.common.cloud.ConnectionManager@637a799f name:ZooKeeperConnection Watcher:127.0.0.1:43566/solr got event WatchedEvent state:SyncConnected type:None path:null path:null type:None
   [junit4]   2> 1696385 INFO  (TEST-CollectionsAPIDistributedZkTest.test-seed#[EB19EDDE5315287C]) [    ] o.a.s.c.c.ConnectionManager Client is connected to ZooKeeper
   [junit4]   2> 1696385 INFO  (TEST-CollectionsAPIDistributedZkTest.test-seed#[EB19EDDE5315287C]) [    ] o.a.s.c.c.SolrZkClient Using default ZkACLProvider
   [junit4]   2> 1696386 INFO  (TEST-CollectionsAPIDistributedZkTest.test-seed#[EB19EDDE5315287C]) [    ] o.a.s.c.c.SolrZkClient makePath: /collections/collection1
   [junit4]   2> 1696389 INFO  (TEST-CollectionsAPIDistributedZkTest.test-seed#[EB19EDDE5315287C]) [    ] o.a.s.c.c.SolrZkClient makePath: /collections/collection1/shards
   [junit4]   2> 1696392 INFO  (TEST-CollectionsAPIDistributedZkTest.test-seed#[EB19EDDE5315287C]) [    ] o.a.s.c.c.SolrZkClient makePath: /collections/control_collection
   [junit4]   2> 1696393 INFO  (TEST-CollectionsAPIDistributedZkTest.test-seed#[EB19EDDE5315287C]) [    ] o.a.s.c.c.SolrZkClient makePath: /collections/control_collection/shards
   [junit4]   2> 1696396 INFO  (TEST-CollectionsAPIDistributedZkTest.test-seed#[EB19EDDE5315287C]) [    ] o.a.s.c.AbstractZkTestCase put /x1/jenkins/jenkins-slave/workspace/Lucene-Solr-NightlyTests-5.4/solr/core/src/test-files/solr/collection1/conf/solrconfig-tlog.xml to /configs/conf1/solrconfig.xml
   [junit4]   2> 1696397 INFO  (TEST-CollectionsAPIDistributedZkTest.test-seed#[EB19EDDE5315287C]) [    ] o.a.s.c.c.SolrZkClient makePath: /configs/conf1/solrconfig.xml
   [junit4]   2> 1696400 INFO  (TEST-CollectionsAPIDistributedZkTest.test-seed#[EB19EDDE5315287C]) [    ] o.a.s.c.AbstractZkTestCase put /x1/jenkins/jenkins-slave/workspace/Lucene-Solr-NightlyTests-5.4/solr/core/src/test-files/solr/collection1/conf/schema.xml to /configs/conf1/schema.xml
   [junit4]   2> 1696401 INFO  (TEST-CollectionsAPIDistributedZkTest.test-seed#[EB19EDDE5315287C]) [    ] o.a.s.c.c.SolrZkClient makePath: /configs/conf1/schema.xml
   [junit4]   2> 1696404 INFO  (TEST-CollectionsAPIDistributedZkTest.test-seed#[EB19EDDE5315287C]) [    ] o.a.s.c.AbstractZkTestCase put /x1/jenkins/jenkins-slave/workspace/Lucene-Solr-NightlyTests-5.4/solr/core/src/test-files/solr/collection1/conf/solrconfig.snippet.randomindexconfig.xml to /configs/conf1/solrconfig.snippet.randomindexconfig.xml
   [junit4]   2> 1696404 INFO  (TEST-CollectionsAPIDistributedZkTest.test-seed#[EB19EDDE5315287C]) [    ] o.a.s.c.c.SolrZkClient makePath: /configs/conf1/solrconfig.snippet.randomindexconfig.xml
   [junit4]   2> 1696406 INFO  (TEST-CollectionsAPIDistributedZkTest.test-seed#[EB19EDDE5315287C]) [    ] o.a.s.c.AbstractZkTestCase put /x1/jenkins/jenkins-slave/workspace/Lucene-Solr-NightlyTests-5.4/solr/core/src/test-files/solr/collection1/conf/stopwords.txt to /configs/conf1/stopwords.txt
   [junit4]   2> 1696406 INFO  (TEST-CollectionsAPIDistributedZkTest.test-seed#[EB19EDDE5315287C]) [    ] o.a.s.c.c.SolrZkClient makePath: /configs/conf1/stopwords.txt
   [junit4]   2> 1696408 INFO  (TEST-CollectionsAPIDistributedZkTest.test-seed#[EB19EDDE5315287C]) [    ] o.a.s.c.AbstractZkTestCase put /x1/jenkins/jenkins-slave/workspace/Lucene-Solr-NightlyTests-5.4/solr/core/src/test-files/solr/collection1/conf/protwords.txt to /configs/conf1/protwords.txt
   [junit4]   2> 1696409 INFO  (TEST-CollectionsAPIDistributedZkTest.test-seed#[EB19EDDE5315287C]) [    ] o.a.s.c.c.SolrZkClient makePath: /configs/conf1/protwords.txt
   [junit4]   2> 1696411 INFO  (TEST-CollectionsAPIDistributedZkTest.test-seed#[EB19EDDE5315287C]) [    ] o.a.s.c.AbstractZkTestCase put /x1/jenkins/jenkins-slave/workspace/Lucene-Solr-NightlyTests-5.4/solr/core/src/test-files/solr/collection1/conf/currency.xml to /configs/conf1/currency.xml
   [junit4]   2> 1696411 INFO  (TEST-CollectionsAPIDistributedZkTest.test-seed#[EB19EDDE5315287C]) [    ] o.a.s.c.c.SolrZkClient makePath: /configs/conf1/currency.xml
   [junit4]   2> 1696413 INFO  (TEST-CollectionsAPIDistributedZkTest.test-seed#[EB19EDDE5315287C]) [    ] o.a.s.c.AbstractZkTestCase put /x1/jenkins/jenkins-slave/workspace/Lucene-Solr-NightlyTests-5.4/solr/core/src/test-files/solr/collection1/conf/enumsConfig.xml to /configs/conf1/enumsConfig.xml
   [junit4]   2> 1696413 INFO  (TEST-CollectionsAPIDistributedZkTest.test-seed#[EB19EDDE5315287C]) [    ] o.a.s.c.c.SolrZkClient makePath: /configs/conf1/enumsConfig.xml
   [junit4]   2> 1696415 INFO  (TEST-CollectionsAPIDistributedZkTest.test-seed#[EB19EDDE5315287C]) [    ] o.a.s.c.AbstractZkTestCase put /x1/jenkins/jenkins-slave/workspace/Lucene-Solr-NightlyTests-5.4/solr/core/src/test-files/solr/collection1/conf/open-exchange-rates.json to /configs/conf1/open-exchange-rates.json
   [junit4]   2> 1696416 INFO  (TEST-CollectionsAPIDistributedZkTest.test-seed#[EB19EDDE5315287C]) [    ] o.a.s.c.c.SolrZkClient makePath: /configs/conf1/open-exchange-rates.json
   [junit4]   2> 1696418 INFO  (TEST-CollectionsAPIDistributedZkTest.test-seed#[EB19EDDE5315287C]) [    ] o.a.s.c.AbstractZkTestCase put /x1/jenkins/jenkins-slave/workspace/Lucene-Solr-NightlyTests-5.4/solr/core/src/test-files/solr/collection1/conf/mapping-ISOLatin1Accent.txt to /configs/conf1/mapping-ISOLatin1Accent.txt
   [junit4]   2> 1696418 INFO  (TEST-CollectionsAPIDistributedZkTest.test-seed#[EB19EDDE5315287C]) [    ] o.a.s.c.c.SolrZkClient makePath: /configs/conf1/mapping-ISOLatin1Accent.txt
   [junit4]   2> 1696421 INFO  (TEST-CollectionsAPIDistributedZkTest.test-seed#[EB19EDDE5315287C]) [    ] o.a.s.c.AbstractZkTestCase put /x1/jenkins/jenkins-slave/workspace/Lucene-Solr-NightlyTests-5.4/solr/core/src/test-files/solr/collection1/conf/old_synonyms.txt to /configs/conf1/old_synonyms.txt
   [junit4]   2> 1696421 INFO  (TEST-CollectionsAPIDistributedZkTest.test-seed#[EB19EDDE5315287C]) [    ] o.a.s.c.c.SolrZkClient makePath: /configs/conf1/old_synonyms.txt
   [junit4]   2> 1696423 INFO  (TEST-CollectionsAPIDistributedZkTest.test-seed#[EB19EDDE5315287C]) [    ] o.a.s.c.AbstractZkTestCase put /x1/jenkins/jenkins-slave/workspace/Lucene-Solr-NightlyTests-5.4/solr/core/src/test-files/solr/collection1/conf/synonyms.txt to /configs/conf1/synonyms.txt
   [junit4]   2> 1696424 INFO  (TEST-CollectionsAPIDistributedZkTest.test-seed#[EB19EDDE5315287C]) [    ] o.a.s.c.c.SolrZkClient makePath: /configs/conf1/synonyms.txt
   [junit4]   2> 1696783 INFO  (TEST-CollectionsAPIDistributedZkTest.test-seed#[EB19EDDE5315287C]) [    ] o.a.s.SolrTestCaseJ4 Writing core.properties file to /x1/jenkins/jenkins-slave/workspace/Lucene-Solr-NightlyTests-5.4/solr/build/solr-core/test/J0/temp/solr.cloud.CollectionsAPIDistributedZkTest_EB19EDDE5315287C-001/control-001/cores/collection1
   [junit4]   2> 1696785 INFO  (TEST-CollectionsAPIDistributedZkTest.test-seed#[EB19EDDE5315287C]) [    ] o.e.j.s.Server jetty-9.2.13.v20150730
   [junit4]   2> 1696787 INFO  (TEST-CollectionsAPIDistributedZkTest.test-seed#[EB19EDDE5315287C]) [    ] o.e.j.s.h.ContextHandler Started o.e.j.s.ServletContextHandler@18f0b0aa{/_pm,null,AVAILABLE}
   [junit4]   2> 1696789 INFO  (TEST-CollectionsAPIDistributedZkTest.test-seed#[EB19EDDE5315287C]) [    ] o.e.j.s.ServerConnector Started ServerConnector@5400a802{HTTP/1.1}{127.0.0.1:58841}
   [junit4]   2> 1696789 INFO  (TEST-CollectionsAPIDistributedZkTest.test-seed#[EB19EDDE5315287C]) [    ] o.e.j.s.Server Started @1699568ms
   [junit4]   2> 1696789 INFO  (TEST-CollectionsAPIDistributedZkTest.test-seed#[EB19EDDE5315287C]) [    ] o.a.s.c.s.e.JettySolrRunner Jetty properties: {solr.data.dir=/x1/jenkins/jenkins-slave/workspace/Lucene-Solr-NightlyTests-5.4/solr/build/solr-core/test/J0/temp/solr.cloud.CollectionsAPIDistributedZkTest_EB19EDDE5315287C-001/tempDir-001/control/data, hostContext=/_pm, hostPort=58841, coreRootDirectory=/x1/jenkins/jenkins-slave/workspace/Lucene-Solr-NightlyTests-5.4/solr/build/solr-core/test/J0/temp/solr.cloud.CollectionsAPIDistributedZkTest_EB19EDDE5315287C-001/control-001/cores}
   [junit4]   2> 1696789 INFO  (TEST-CollectionsAPIDistributedZkTest.test-seed#[EB19EDDE5315287C]) [    ] o.a.s.s.SolrDispatchFilter SolrDispatchFilter.init(): sun.misc.Launcher$AppClassLoader@7b3cb2c6
   [junit4]   2> 1696789 INFO  (TEST-CollectionsAPIDistributedZkTest.test-seed#[EB19EDDE5315287C]) [    ] o.a.s.c.SolrResourceLoader new SolrResourceLoader for directory: '/x1/jenkins/jenkins-slave/workspace/Lucene-Solr-NightlyTests-5.4/solr/build/solr-core/test/J0/temp/solr.cloud.CollectionsAPIDistributedZkTest_EB19EDDE5315287C-001/control-001'
   [junit4]   2> 1696790 INFO  (TEST-CollectionsAPIDistributedZkTest.test-seed#[EB19EDDE5315287C]) [    ] o.a.s.c.SolrResourceLoader JNDI not configured for solr (NoInitialContextEx)
   [junit4]   2> 1696790 INFO  (TEST-CollectionsAPIDistributedZkTest.test-seed#[EB19EDDE5315287C]) [    ] o.a.s.c.SolrResourceLoader solr home defaulted to 'solr/' (could not find system property or JNDI)
   [junit4]   2> 1696790 INFO  (TEST-CollectionsAPIDistributedZkTest.test-seed#[EB19EDDE5315287C]) [    ] o.a.s.c.c.SolrZkClient Using default ZkCredentialsProvider
   [junit4]   2> 1696790 INFO  (TEST-CollectionsAPIDistributedZkTest.test-seed#[EB19EDDE5315287C]) [    ] o.a.s.c.c.ConnectionManager Waiting for client to connect to ZooKeeper
   [junit4]   2> 1696792 INFO  (zkCallback-1074-thread-1) [    ] o.a.s.c.c.ConnectionManager Watcher org.apache.solr.common.cloud.ConnectionManager@62e822b3 name:ZooKeeperConnection Watcher:127.0.0.1:43566/solr got event WatchedEvent state:SyncConnected type:None path:null path:null type:None
   [junit4]   2> 1696792 INFO  (TEST-CollectionsAPIDistributedZkTest.test-seed#[EB19EDDE5315287C]) [    ] o.a.s.c.c.ConnectionManager Client is connected to ZooKeeper
   [junit4]   2> 1696792 INFO  (TEST-CollectionsAPIDistributedZkTest.test-seed#[EB19EDDE5315287C]) [    ] o.a.s.c.c.SolrZkClient Using default ZkACLProvider
   [junit4]   2> 1696793 INFO  (TEST-CollectionsAPIDistributedZkTest.test-seed#[EB19EDDE5315287C]) [    ] o.a.s.s.SolrDispatchFilter Loading solr.xml from SolrHome (not found in ZooKeeper)
   [junit4]   2> 1696794 INFO  (TEST-CollectionsAPIDistributedZkTest.test-seed#[EB19EDDE5315287C]) [    ] o.a.s.c.SolrXmlConfig Loading container configuration from /x1/jenkins/jenkins-slave/workspace/Lucene-Solr-NightlyTests-5.4/solr/build/solr-core/test/J0/temp/solr.cloud.CollectionsAPIDistributedZkTest_EB19EDDE5315287C-001/control-001/solr.xml
   [junit4]   2> 1696810 INFO  (TEST-CollectionsAPIDistributedZkTest.test-seed#[EB19EDDE5315287C]) [    ] o.a.s.c.CorePropertiesLocator Config-defined core root directory: /x1/jenkins/jenkins-slave/workspace/Lucene-Solr-NightlyTests-5.4/solr/build/solr-core/test/J0/temp/solr.cloud.CollectionsAPIDistributedZkTest_EB19EDDE5315287C-001/control-001/cores
   [junit4]   2> 1696810 INFO  (TEST-CollectionsAPIDistributedZkTest.test-seed#[EB19EDDE5315287C]) [    ] o.a.s.c.CoreContainer New CoreContainer 1732848339
   [junit4]   2> 1696810 INFO  (TEST-CollectionsAPIDistributedZkTest.test-seed#[EB19EDDE5315287C]) [    ] o.a.s.c.CoreContainer Loading cores into CoreContainer [instanceDir=/x1/jenkins/jenkins-slave/workspace/Lucene-Solr-NightlyTests-5.4/solr/build/solr-core/test/J0/temp/solr.cloud.CollectionsAPIDistributedZkTest_EB19EDDE5315287C-001/control-001]
   [junit4]   2> 1696810 WARN  (TEST-CollectionsAPIDistributedZkTest.test-seed#[EB19EDDE5315287C]) [    ] o.a.s.c.CoreContainer Couldn't add files from /x1/jenkins/jenkins-slave/workspace/Lucene-Solr-NightlyTests-5.4/solr/build/solr-core/test/J0/temp/solr.cloud.CollectionsAPIDistributedZkTest_EB19EDDE5315287C-001/control-001/lib to classpath: /x1/jenkins/jenkins-slave/workspace/Lucene-Solr-NightlyTests-5.4/solr/build/solr-core/test/J0/temp/solr.cloud.CollectionsAPIDistributedZkTest_EB19EDDE5315287C-001/control-001/lib
   [junit4]   2> 1696810 INFO  (TEST-CollectionsAPIDistributedZkTest.test-seed#[EB19EDDE5315287C]) [    ] o.a.s.h.c.HttpShardHandlerFactory created with socketTimeout : 90000,urlScheme : ,connTimeout : 15000,maxConnectionsPerHost : 20,maxConnections : 10000,corePoolSize : 0,maximumPoolSize : 2147483647,maxThreadIdleTime : 5,sizeOfQueue : -1,fairnessPolicy : false,useRetries : false,
   [junit4]   2> 1696812 INFO  (TEST-CollectionsAPIDistributedZkTest.test-seed#[EB19EDDE5315287C]) [    ] o.a.s.u.UpdateShardHandler Creating UpdateShardHandler HTTP client with params: socketTimeout=340000&connTimeout=45000&retry=true
   [junit4]   2> 1696812 INFO  (TEST-CollectionsAPIDistributedZkTest.test-seed#[EB19EDDE5315287C]) [    ] o.a.s.l.LogWatcher SLF4J impl is org.slf4j.impl.Log4jLoggerFactory
   [junit4]   2> 1696812 INFO  (TEST-CollectionsAPIDistributedZkTest.test-seed#[EB19EDDE5315287C]) [    ] o.a.s.l.LogWatcher Registering Log Listener [Log4j (org.slf4j.impl.Log4jLoggerFactory)]
   [junit4]   2> 1696812 INFO  (TEST-CollectionsAPIDistributedZkTest.test-seed#[EB19EDDE5315287C]) [    ] o.a.s.c.ZkContainer Zookeeper client=127.0.0.1:43566/solr
   [junit4]   2> 1696813 INFO  (TEST-CollectionsAPIDistributedZkTest.test-seed#[EB19EDDE5315287C]) [    ] o.a.s.c.ZkController zkHost includes chroot
   [junit4]   2> 1696813 INFO  (TEST-CollectionsAPIDistributedZkTest.test-seed#[EB19EDDE5315287C]) [    ] o.a.s.c.c.SolrZkClient Using default ZkCredentialsProvider
   [junit4]   2> 1696814 INFO  (TEST-CollectionsAPIDistributedZkTest.test-seed#[EB19EDDE5315287C]) [    ] o.a.s.c.c.ConnectionManager Waiting for client to connect to ZooKeeper
   [junit4]   2> 1696815 INFO  (zkCallback-1076-thread-1) [    ] o.a.s.c.c.ConnectionManager Watcher org.apache.solr.common.cloud.ConnectionManager@182b19b9 name:ZooKeeperConnection Watcher:127.0.0.1:43566 got event WatchedEvent state:SyncConnected type:None path:null path:null type:None
   [junit4]   2> 1696815 INFO  (TEST-CollectionsAPIDistributedZkTest.test-seed#[EB19EDDE5315287C]) [    ] o.a.s.c.c.ConnectionManager Client is connected to ZooKeeper
   [junit4]   2> 1696815 INFO  (TEST-CollectionsAPIDistributedZkTest.test-seed#[EB19EDDE5315287C]) [    ] o.a.s.c.c.SolrZkClient Using default ZkACLProvider
   [junit4]   2> 1696817 INFO  (TEST-CollectionsAPIDistributedZkTest.test-seed#[EB19EDDE5315287C]) [n:127.0.0.1:58841__pm    ] o.a.s.c.c.ConnectionManager Waiting for client to connect to ZooKeeper
   [junit4]   2> 1696818 INFO  (zkCallback-1077-thread-1-processing-n:127.0.0.1:58841__pm) [n:127.0.0.1:58841__pm    ] o.a.s.c.c.ConnectionManager Watcher org.apache.solr.common.cloud.ConnectionManager@45ab574a name:ZooKeeperConnection Watcher:127.0.0.1:43566/solr got event WatchedEvent state:SyncConnected type:None path:null path:null type:None
   [junit4]   2> 1696818 INFO  (TEST-CollectionsAPIDistributedZkTest.test-seed#[EB19EDDE5315287C]) [n:127.0.0.1:58841__pm    ] o.a.s.c.c.ConnectionManager Client is connected to ZooKeeper
   [junit4]   2> 1696820 INFO  (TEST-CollectionsAPIDistributedZkTest.test-seed#[EB19EDDE5315287C]) [n:127.0.0.1:58841__pm    ] o.a.s.c.c.SolrZkClient makePath: /overseer/queue
   [junit4]   2> 1696822 INFO  (TEST-CollectionsAPIDistributedZkTest.test-seed#[EB19EDDE5315287C]) [n:127.0.0.1:58841__pm    ] o.a.s.c.c.SolrZkClient makePath: /overseer/collection-queue-work
   [junit4]   2> 1696825 INFO  (TEST-CollectionsAPIDistributedZkTest.test-seed#[EB19EDDE5315287C]) [n:127.0.0.1:58841__pm    ] o.a.s.c.c.SolrZkClient makePath: /overseer/collection-map-running
   [junit4]   2> 1696828 INFO  (TEST-CollectionsAPIDistributedZkTest.test-seed#[EB19EDDE5315287C]) [n:127.0.0.1:58841__pm    ] o.a.s.c.c.SolrZkClient makePath: /overseer/collection-map-completed
   [junit4]   2> 1696830 INFO  (TEST-CollectionsAPIDistributedZkTest.test-seed#[EB19EDDE5315287C]) [n:127.0.0.1:58841__pm    ] o.a.s.c.c.SolrZkClient makePath: /overseer/collection-map-failure
   [junit4]   2> 1696832 INFO  (TEST-CollectionsAPIDistributedZkTest.test-seed#[EB19EDDE5315287C]) [n:127.0.0.1:58841__pm    ] o.a.s.c.c.SolrZkClient makePath: /live_nodes
   [junit4]   2> 1696834 INFO  (TEST-CollectionsAPIDistributedZkTest.test-seed#[EB19EDDE5315287C]) [n:127.0.0.1:58841__pm    ] o.a.s.c.c.SolrZkClient makePath: /aliases.json
   [junit4]   2> 1696835 INFO  (TEST-CollectionsAPIDistributedZkTest.test-seed#[EB19EDDE5315287C]) [n:127.0.0.1:58841__pm    ] o.a.s.c.c.SolrZkClient makePath: /clusterstate.json
   [junit4]   2> 1696837 INFO  (TEST-CollectionsAPIDistributedZkTest.test-seed#[EB19EDDE5315287C]) [n:127.0.0.1:58841__pm    ] o.a.s.c.c.SolrZkClient makePath: /security.json
   [junit4]   2> 1696838 INFO  (TEST-CollectionsAPIDistributedZkTest.test-seed#[EB19EDDE5315287C]) [n:127.0.0.1:58841__pm    ] o.a.s.c.ZkController Register node as live in ZooKeeper:/live_nodes/127.0.0.1:58841__pm
   [junit4]   2> 1696838 INFO  (TEST-CollectionsAPIDistributedZkTest.test-seed#[EB19EDDE5315287C]) [n:127.0.0.1:58841__pm    ] o.a.s.c.c.SolrZkClient makePath: /live_nodes/127.0.0.1:58841__pm
   [junit4]   2> 1696840 INFO  (TEST-CollectionsAPIDistributedZkTest.test-seed#[EB19EDDE5315287C]) [n:127.0.0.1:58841__pm    ] o.a.s.c.c.SolrZkClient makePath: /overseer_elect
   [junit4]   2> 1696842 INFO  (TEST-CollectionsAPIDistributedZkTest.test-seed#[EB19EDDE5315287C]) [n:127.0.0.1:58841__pm    ] o.a.s.c.c.SolrZkClient makePath: /overseer_elect/election
   [junit4]   2> 1696843 INFO  (TEST-CollectionsAPIDistributedZkTest.test-seed#[EB19EDDE5315287C]) [n:127.0.0.1:58841__pm    ] o.a.s.c.Overseer Overseer (id=null) closing
   [junit4]   2> 1696844 INFO  (TEST-CollectionsAPIDistributedZkTest.test-seed#[EB19EDDE5315287C]) [n:127.0.0.1:58841__pm    ] o.a.s.c.LeaderElector Joined leadership election with path: /overseer_elect/election/94999150421606404-127.0.0.1:58841__pm-n_0000000000
   [junit4]   2> 1696844 INFO  (TEST-CollectionsAPIDistributedZkTest.test-seed#[EB19EDDE5315287C]) [n:127.0.0.1:58841__pm    ] o.a.s.c.OverseerElectionContext I am going to be the leader 127.0.0.1:58841__pm
   [junit4]   2> 1696844 INFO  (TEST-CollectionsAPIDistributedZkTest.test-seed#[EB19EDDE5315287C]) [n:127.0.0.1:58841__pm    ] o.a.s.c.c.SolrZkClient makePath: /overseer_elect/leader
   [junit4]   2> 1696846 INFO  (TEST-CollectionsAPIDistributedZkTest.test-seed#[EB19EDDE5315287C]) [n:127.0.0.1:58841__pm    ] o.a.s.c.Overseer Overseer (id=94999150421606404-127.0.0.1:58841__pm-n_0000000000) starting
   [junit4]   2> 1696848 INFO  (TEST-CollectionsAPIDistributedZkTest.test-seed#[EB19EDDE5315287C]) [n:127.0.0.1:58841__pm    ] o.a.s.c.c.SolrZkClient makePath: /overseer/queue-work
   [junit4]   2> 1696854 INFO  (TEST-CollectionsAPIDistributedZkTest.test-seed#[EB19EDDE5315287C]) [n:127.0.0.1:58841__pm    ] o.a.s.c.OverseerAutoReplicaFailoverThread Starting OverseerAutoReplicaFailoverThread autoReplicaFailoverWorkLoopDelay=10000 autoReplicaFailoverWaitAfterExpiration=10000 autoReplicaFailoverBadNodeExpiration=60000
   [junit4]   2> 1696854 INFO  (TEST-CollectionsAPIDistributedZkTest.test-seed#[EB19EDDE5315287C]) [n:127.0.0.1:58841__pm    ] o.a.s.c.c.ZkStateReader Updating cluster state from ZooKeeper... 
   [junit4]   2> 1696854 INFO  (OverseerCollectionConfigSetProcessor-94999150421606404-127.0.0.1:58841__pm-n_0000000000) [n:127.0.0.1:58841__pm    ] o.a.s.c.OverseerTaskProcessor Process current queue of overseer operations
   [junit4]   2> 1696855 INFO  (OverseerStateUpdate-94999150421606404-127.0.0.1:58841__pm-n_0000000000) [n:127.0.0.1:58841__pm    ] o.a.s.c.Overseer Starting to work on the main queue
   [junit4]   2> 1696869 INFO  (TEST-CollectionsAPIDistributedZkTest.test-seed#[EB19EDDE5315287C]) [n:127.0.0.1:58841__pm    ] o.a.s.c.CoreContainer Security conf doesn't exist. Skipping setup for authorization module.
   [junit4]   2> 1696869 INFO  (TEST-CollectionsAPIDistributedZkTest.test-seed#[EB19EDDE5315287C]) [n:127.0.0.1:58841__pm    ] o.a.s.c.CoreContainer No authentication plugin used.
   [junit4]   2> 1696870 INFO  (TEST-CollectionsAPIDistributedZkTest.test-seed#[EB19EDDE5315287C]) [n:127.0.0.1:58841__pm    ] o.a.s.c.CorePropertiesLocator Looking for core definitions underneath /x1/jenkins/jenkins-slave/workspace/Lucene-Solr-NightlyTests-5.4/solr/build/solr-core/test/J0/temp/solr.cloud.CollectionsAPIDistributedZkTest_EB19EDDE5315287C-001/control-001/cores
   [junit4]   2> 1696871 INFO  (TEST-CollectionsAPIDistributedZkTest.test-seed#[EB19EDDE5315287C]) [n:127.0.0.1:58841__pm    ] o.a.s.c.CoreDescriptor Created CoreDescriptor: {dataDir=data/, loadOnStartup=true, schema=schema.xml, shard=, configSetProperties=configsetprops.json, coreNodeName=, name=collection1, transient=false, config=solrconfig.xml, collection=control_collection, instanceDir=/x1/jenkins/jenkins-slave/workspace/Lucene-Solr-NightlyTests-5.4/solr/build/solr-core/test/J0/temp/solr.cloud.CollectionsAPIDistributedZkTest_EB19EDDE5315287C-001/control-001/cores/collection1, absoluteInstDir=/x1/jenkins/jenkins-slave/workspace/Lucene-Solr-NightlyTests-5.4/solr/build/solr-core/test/J0/temp/solr.cloud.CollectionsAPIDistributedZkTest_EB19EDDE5315287C-001/control-001/cores/collection1/}
   [junit4]   2> 1696871 INFO  (TEST-CollectionsAPIDistributedZkTest.test-seed#[EB19EDDE5315287C]) [n:127.0.0.1:58841__pm    ] o.a.s.c.CorePropertiesLocator Found core collection1 in /x1/jenkins/jenkins-slave/workspace/Lucene-Solr-NightlyTests-5.4/solr/build/solr-core/test/J0/temp/solr.cloud.CollectionsAPIDistributedZkTest_EB19EDDE5315287C-001/control-001/cores/collection1/
   [junit4]   2> 1696871 INFO  (TEST-CollectionsAPIDistributedZkTest.test-seed#[EB19EDDE5315287C]) [n:127.0.0.1:58841__pm    ] o.a.s.c.CorePropertiesLocator Found 1 core definitions
   [junit4]   2> 1696872 INFO  (TEST-CollectionsAPIDistributedZkTest.test-seed#[EB19EDDE5315287C]) [n:127.0.0.1:58841__pm    ] o.a.s.s.SolrDispatchFilter user.dir=/x1/jenkins/jenkins-slave/workspace/Lucene-Solr-NightlyTests-5.4/solr/build/solr-core/test/J0
   [junit4]   2> 1696872 INFO  (coreLoadExecutor-3660-thread-1-processing-n:127.0.0.1:58841__pm) [n:127.0.0.1:58841__pm c:control_collection   x:collection1] o.a.s.c.ZkController publishing state=down
   [junit4]   2> 1696872 INFO  (TEST-CollectionsAPIDistributedZkTest.test-seed#[EB19EDDE5315287C]) [n:127.0.0.1:58841__pm    ] o.a.s.s.SolrDispatchFilter SolrDispatchFilter.init() done
   [junit4]   2> 1696872 INFO  (coreLoadExecutor-3660-thread-1-processing-n:127.0.0.1:58841__pm) [n:127.0.0.1:58841__pm c:control_collection   x:collection1] o.a.s.c.ZkController numShards not found on descriptor - reading it from system property
   [junit4]   2> 1696875 INFO  (OverseerStateUpdate-94999150421606404-127.0.0.1:58841__pm-n_0000000000) [n:127.0.0.1:58841__pm    ] o.a.s.c.Overseer processMessage: queueSize: 1, message = {
   [junit4]   2>   "shard":null,
   [junit4]   2>   "node_name":"127.0.0.1:58841__pm",
   [junit4]   2>   "base_url":"http://127.0.0.1:58841/_pm",
   [junit4]   2>   "roles":null,
   [junit4]   2>   "core":"collection1",
   [junit4]   2>   "collection":"control_collection",
   [junit4]   2>   "numShards":"1",
   [junit4]   2>   "operation":"state",
   [junit4]   2>   "state":"down"} current state version: 0
   [junit4]   2> 1696875 INFO  (coreLoadExecutor-3660-thread-1-processing-n:127.0.0.1:58841__pm) [n:127.0.0.1:58841__pm c:control_collection   x:collection1] o.a.s.c.ZkController look for our core node name
   [junit4]   2> 1696875 INFO  (OverseerStateUpdate-94999150421606404-127.0.0.1:58841__pm-n_0000000000) [n:127.0.0.1:58841__pm    ] o.a.s.c.o.ReplicaMutator Update state numShards=1 message={
   [junit4]   2>   "shard":null,
   [junit4]   2>   "node_name":"127.0.0.1:58841__pm",
   [junit4]   2>   "base_url":"http://127.0.0.1:58841/_pm",
   [junit4]   2>   "roles":null,
   [junit4]   2>   "core":"collection1",
   [junit4]   2>   "collection":"control_collection",
   [junit4]   2>   "numShards":"1",
   [junit4]   2>   "operation":"state",
   [junit4]   2>   "state":"down"}
   [junit4]   2> 1696875 INFO  (OverseerStateUpdate-94999150421606404-127.0.0.1:58841__pm-n_0000000000) [n:127.0.0.1:58841__pm    ] o.a.s.c.o.ClusterStateMutator building a new cName: control_collection
   [junit4]   2> 1696876 INFO  (OverseerStateUpdate-94999150421606404-127.0.0.1:58841__pm-n_0000000000) [n:127.0.0.1:58841__pm    ] o.a.s.c.o.ReplicaMutator Assigning new node to shard shard=shard1
   [junit4]   2> 1696878 INFO  (zkCallback-1077-thread-1-processing-n:127.0.0.1:58841__pm) [n:127.0.0.1:58841__pm    ] o.a.s.c.c.ZkStateReader A cluster state change: WatchedEvent state:SyncConnected type:NodeDataChanged path:/clusterstate.json, has occurred - updating... (live nodes size: 1)
   [junit4]   2> 1697875 INFO  (coreLoadExecutor-3660-thread-1-processing-n:127.0.0.1:58841__pm) [n:127.0.0.1:58841__pm c:control_collection   x:collection1] o.a.s.c.ZkController waiting to find shard id in clusterstate for collection1
   [junit4]   2> 1697875 INFO  (coreLoadExecutor-3660-thread-1-processing-n:127.0.0.1:58841__pm) [n:127.0.0.1:58841__pm c:control_collection   x:collection1] o.a.s.c.ZkController Check for collection zkNode:control_collection
   [junit4]   2> 1697876 INFO  (coreLoadExecutor-3660-thread-1-processing-n:127.0.0.1:58841__pm) [n:127.0.0.1:58841__pm c:control_collection   x:collection1] o.a.s.c.ZkController Collection zkNode exists
   [junit4]   2> 1697876 INFO  (coreLoadExecutor-3660-thread-1-processing-n:127.0.0.1:58841__pm) [n:127.0.0.1:58841__pm c:control_collection   x:collection1] o.a.s.c.c.ZkStateReader Load collection config from:/collections/control_collection
   [junit4]   2> 1697877 INFO  (coreLoadExecutor-3660-thread-1-processing-n:127.0.0.1:58841__pm) [n:127.0.0.1:58841__pm c:control_collection   x:collection1] o.a.s.c.c.ZkStateReader path=/collections/control_collection configName=conf1 specified config exists in ZooKeeper
   [junit4]   2> 1697877 INFO  (coreLoadExecutor-3660-thread-1-processing-n:127.0.0.1:58841__pm) [n:127.0.0.1:58841__pm c:control_collection   x:collection1] o.a.s.c.SolrResourceLoader new SolrResourceLoader for directory: '/x1/jenkins/jenkins-slave/workspace/Lucene-Solr-NightlyTests-5.4/solr/build/solr-core/test/J0/temp/solr.cloud.CollectionsAPIDistributedZkTest_EB19EDDE5315287C-001/control-001/cores/collection1'
   [junit4]   2> 1697877 INFO  (coreLoadExecutor-3660-thread-1-processing-n:127.0.0.1:58841__pm) [n:127.0.0.1:58841__pm c:control_collection   x:collection1] o.a.s.c.SolrResourceLoader JNDI not configured for solr (NoInitialContextEx)
   [junit4]   2> 1697877 INFO  (coreLoadExecutor-3660-thread-1-processing-n:127.0.0.1:58841__pm) [n:127.0.0.1:58841__pm c:control_collection   x:collection1] o.a.s.c.SolrResourceLoader solr home defaulted to 'solr/' (could not find system property or JNDI)
   [junit4]   2> 1697880 INFO  (coreLoadExecutor-3660-thread-1-processing-n:127.0.0.1:58841__pm) [n:127.0.0.1:58841__pm c:control_collection   x:collection1] o.a.s.c.Config loaded config solrconfig.xml with version 0 
   [junit4]   2> 1697887 INFO  (coreLoadExecutor-3660-thread-1-processing-n:127.0.0.1:58841__pm) [n:127.0.0.1:58841__pm c:control_collection   x:collection1] o.a.s.c.SolrConfig current version of requestparams : -1
   [junit4]   2> 1697902 INFO  (coreLoadExecutor-3660-thread-1-processing-n:127.0.0.1:58841__pm) [n:127.0.0.1:58841__pm c:control_collection   x:collection1] o.a.s.c.SolrConfig Using Lucene MatchVersion: 5.4.0
   [junit4]   2> 1697933 INFO  (coreLoadExecutor-3660-thread-1-processing-n:127.0.0.1:58841__pm) [n:127.0.0.1:58841__pm c:control_collection   x:collection1] o.a.s.c.SolrConfig Loaded SolrConfig: solrconfig.xml
   [junit4]   2> 1697942 INFO  (coreLoadExecutor-3660-thread-1-processing-n:127.0.0.1:58841__pm) [n:127.0.0.1:58841__pm c:control_collection   x:collection1] o.a.s.s.IndexSchema [collection1] Schema name=test
   [junit4]   2> 1698217 INFO  (coreLoadExecutor-3660-thread-1-processing-n:127.0.0.1:58841__pm) [n:127.0.0.1:58841__pm c:control_collection   x:collection1] o.a.s.s.OpenExchangeRatesOrgProvider Initialized with rates=open-exchange-rates.json, refreshInterval=1440.
   [junit4]   2> 1698226 INFO  (coreLoadExecutor-3660-thread-1-processing-n:127.0.0.1:58841__pm) [n:127.0.0.1:58841__pm c:control_collection   x:collection1] o.a.s.s.IndexSchema default search field in schema is text
   [junit4]   2> 1698228 INFO  (coreLoadExecutor-3660-thread-1-processing-n:127.0.0.1:58841__pm) [n:127.0.0.1:58841__pm c:control_collection   x:collection1] o.a.s.s.IndexSchema unique key field: id
   [junit4]   2> 1698239 INFO  (coreLoadExecutor-3660-thread-1-processing-n:127.0.0.1:58841__pm) [n:127.0.0.1:58841__pm c:control_collection   x:collection1] o.a.s.s.FileExchangeRateProvider Reloading exchange rates from file currency.xml
   [junit4]   2> 1698242 INFO  (coreLoadExecutor-3660-thread-1-processing-n:127.0.0.1:58841__pm) [n:127.0.0.1:58841__pm c:control_collection   x:collection1] o.a.s.s.FileExchangeRateProvider Reloading exchange rates from file currency.xml
   [junit4]   2> 1698245 INFO  (coreLoadExecutor-3660-thread-1-processing-n:127.0.0.1:58841__pm) [n:127.0.0.1:58841__pm c:control_collection   x:collection1] o.a.s.s.OpenExchangeRatesOrgProvider Reloading exchange rates from open-exchange-rates.json
   [junit4]   2> 1698246 WARN  (coreLoadExecutor-3660-thread-1-processing-n:127.0.0.1:58841__pm) [n:127.0.0.1:58841__pm c:control_collection   x:collection1] o.a.s.s.OpenExchangeRatesOrgProvider Unknown key IMPORTANT NOTE
   [junit4]   2> 1698246 WARN  (coreLoadExecutor-3660-thread-1-processing-n:127.0.0.1:58841__pm) [n:127.0.0.1:58841__pm c:control_collection   x:collection1] o.a.s.s.OpenExchangeRatesOrgProvider Expected key, got STRING
   [junit4]   2> 1698246 INFO  (coreLoadExecutor-3660-thread-1-processing-n:127.0.0.1:58841__pm) [n:127.0.0.1:58841__pm c:control_collection   x:collection1] o.a.s.s.OpenExchangeRatesOrgProvider Reloading exchange rates from open-exchange-rates.json
   [junit4]   2> 1698247 WARN  (coreLoadExecutor-3660-thread-1-processing-n:127.0.0.1:58841__pm) [n:127.0.0.1:58841__pm c:control_collection   x:collection1] o.a.s.s.OpenExchangeRatesOrgProvider Unknown key IMPORTANT NOTE
   [junit4]   2> 1698247 WARN  (coreLoadExecutor-3660-thread-1-processing-n:127.0.0.1:58841__pm) [n:127.0.0.1:58841__pm c:control_collection   x:collection1] o.a.s.s.OpenExchangeRatesOrgProvider Expected key, got STRING
   [junit4]   2> 1698248 INFO  (coreLoadExecutor-3660-thread-1-processing-n:127.0.0.1:58841__pm) [n:127.0.0.1:58841__pm c:control_collection   x:collection1] o.a.s.c.ConfigSetProperties Did not find ConfigSet properties, assuming default properties: Can't find resource 'configsetprops.json' in classpath or '/configs/conf1', cwd=/x1/jenkins/jenkins-slave/workspace/Lucene-Solr-NightlyTests-5.4/solr/build/solr-core/test/J0
   [junit4]   2> 1698248 INFO  (coreLoadExecutor-3660-thread-1-processing-n:127.0.0.1:58841__pm) [n:127.0.0.1:58841__pm c:control_collection   x:collection1] o.a.s.c.CoreContainer Creating SolrCore 'collection1' using configuration from collection control_collection
   [junit4]   2> 1698248 INFO  (coreLoadExecutor-3660-thread-1-processing-n:127.0.0.1:58841__pm) [n:127.0.0.1:58841__pm c:control_collection s:shard1 r:core_node1 x:collection1] o.a.s.c.SolrCore org.apache.solr.core.MockDirectoryFactory
   [junit4]   2> 1698249 INFO  (coreLoadExecutor-3660-thread-1-processing-n:127.0.0.1:58841__pm) [n:127.0.0.1:58841__pm c:control_collection s:shard1 r:core_node1 x:collection1] o.a.s.c.SolrCore [[collection1] ] Opening new SolrCore at [/x1/jenkins/jenkins-slave/workspace/Lucene-Solr-NightlyTests-5.4/solr/build/solr-core/test/J0/temp/solr.cloud.CollectionsAPIDistributedZkTest_EB19EDDE5315287C-001/control-001/cores/collection1], dataDir=[null]
   [junit4]   2> 1698249 INFO  (coreLoadExecutor-3660-thread-1-processing-n:127.0.0.1:58841__pm) [n:127.0.0.1:58841__pm c:control_collection s:shard1 r:core_node1 x:collection1] o.a.s.c.JmxMonitoredMap JMX monitoring is enabled. Adding Solr mbeans to JMX Server: com.sun.jmx.mbeanserver.JmxMBeanServer@189b7091
   [junit4]   2> 1698249 INFO  (coreLoadExecutor-3660-thread-1-processing-n:127.0.0.1:58841__pm) [n:127.0.0.1:58841__pm c:control_collection s:shard1 r:core_node1 x:collection1] o.a.s.c.CachingDirectoryFactory return new directory for /x1/jenkins/jenkins-slave/workspace/Lucene-Solr-NightlyTests-5.4/solr/build/solr-core/test/J0/temp/solr.cloud.CollectionsAPIDistributedZkTest_EB19EDDE5315287C-001/control-001/cores/collection1/data
   [junit4]   2> 1698249 INFO  (coreLoadExecutor-3660-thread-1-processing-n:127.0.0.1:58841__pm) [n:127.0.0.1:58841__pm c:control_collection s:shard1 r:core_node1 x:collection1] o.a.s.c.SolrCore New index directory detected: old=null new=/x1/jenkins/jenkins-slave/workspace/Lucene-Solr-NightlyTests-5.4/solr/build/solr-core/test/J0/temp/solr.cloud.CollectionsAPIDistributedZkTest_EB19EDDE5315287C-001/control-001/cores/collection1/data/index/
   [junit4]   2> 1698249 WARN  (coreLoadExecutor-3660-thread-1-processing-n:127.0.0.1:58841__pm) [n:127.0.0.1:58841__pm c:control_collection s:shard1 r:core_node1 x:collection1] o.a.s.c.SolrCore [collection1] Solr index directory '/x1/jenkins/jenkins-slave/workspace/Lucene-Solr-NightlyTests-5.4/solr/build/solr-core/test/J0/temp/solr.cloud.CollectionsAPIDistributedZkTest_EB19EDDE5315287C-001/control-001/cores/collection1/data/index' doesn't exist. Creating new index...
   [junit4]   2> 1698250 INFO  (coreLoadExecutor-3660-thread-1-processing-n:127.0.0.1:58841__pm) [n:127.0.0.1:58841__pm c:control_collection s:shard1 r:core_node1 x:collection1] o.a.s.c.CachingDirectoryFactory return new directory for /x1/jenkins/jenkins-slave/workspace/Lucene-Solr-NightlyTests-5.4/solr/build/solr-core/test/J0/temp/solr.cloud.CollectionsAPIDistributedZkTest_EB19EDDE5315287C-001/control-001/cores/collection1/data/index
   [junit4]   2> 1698250 INFO  (coreLoadExecutor-3660-thread-1-processing-n:127.0.0.1:58841__pm) [n:127.0.0.1:58841__pm c:control_collection s:shard1 r:core_node1 x:collection1] o.a.s.u.RandomMergePolicy RandomMergePolicy wrapping class org.apache.lucene.index.LogByteSizeMergePolicy: [LogByteSizeMergePolicy: minMergeSize=1677721, mergeFactor=9, maxMergeSize=2147483648, maxMergeSizeForForcedMerge=9223372036854775807, calibrateSizeByDeletes=false, maxMergeDocs=2147483647, maxCFSSegmentSizeMB=8.796093022207999E12, noCFSRatio=1.0]
   [junit4]   2> 1698250 INFO  (coreLoadExecutor-3660-thread-1-processing-n:127.0.0.1:58841__pm) [n:127.0.0.1:58841__pm c:control_collection s:shard1 r:core_node1 x:collection1] o.a.s.c.SolrDeletionPolicy SolrDeletionPolicy.onCommit: commits: num=1
   [junit4]   2> 	commit{dir=MockDirectoryWrapper(RAMDirectory@9e52655 lockFactory=org.apache.lucene.store.SingleInstanceLockFactory@23379b86),segFN=segments_1,generation=1}
   [junit4]   2> 1698251 INFO  (coreLoadExecutor-3660-thread-1-processing-n:127.0.0.1:58841__pm) [n:127.0.0.1:58841__pm c:control_collection s:shard1 r:core_node1 x:collection1] o.a.s.c.SolrDeletionPolicy newest commit generation = 1
   [junit4]   2> 1698251 INFO  (OldIndexDirectoryCleanupThreadForCore-collection1) [n:127.0.0.1:58841__pm c:control_collection s:shard1 r:core_node1 x:collection1] o.a.s.c.SolrCore Looking for old index directories to cleanup for core collection1 in /x1/jenkins/jenkins-slave/workspace/Lucene-Solr-NightlyTests-5.4/solr/build/solr-core/test/J0/temp/solr.cloud.CollectionsAPIDistributedZkTest_EB19EDDE5315287C-001/control-001/cores/collection1/data/
   [junit4]   2> 1698251 WARN  (OldIndexDirectoryCleanupThreadForCore-collection1) [n:127.0.0.1:58841__pm c:control_collection s:shard1 r:core_node1 x:collection1] o.a.s.c.DirectoryFactory /x1/jenkins/jenkins-slave/workspace/Lucene-Solr-NightlyTests-5.4/solr/build/solr-core/test/J0/temp/solr.cloud.CollectionsAPIDistributedZkTest_EB19EDDE5315287C-001/control-001/cores/collection1/data/ does not point to a valid data directory; skipping clean-up of old index directories.
   [junit4]   2> 1698255 INFO  (coreLoadExecutor-3660-thread-1-processing-n:127.0.0.1:58841__pm) [n:127.0.0.1:58841__pm c:control_collection s:shard1 r:core_node1 x:collection1] o.a.s.u.p.UpdateRequestProcessorChain creating updateRequestProcessorChain "nodistrib"
   [junit4]   2> 1698256 INFO  (coreLoadExecutor-3660-thread-1-processing-n:127.0.0.1:58841__pm) [n:127.0.0.1:58841__pm c:control_collection s:shard1 r:core_node1 x:collection1] o.a.s.u.p.UpdateRequestProcessorChain creating updateRequestProcessorChain "dedupe"
   [junit4]   2> 1698256 INFO  (coreLoadExecutor-3660-thread-1-processing-n:127.0.0.1:58841__pm) [n:127.0.0.1:58841__pm c:control_collection s:shard1 r:core_node1 x:collection1] o.a.s.u.p.UpdateRequestProcessorChain inserting DistributedUpdateProcessorFactory into updateRequestProcessorChain "dedupe"
   [junit4]   2> 1698256 INFO  (coreLoadExecutor-3660-thread-1-processing-n:127.0.0.1:58841__pm) [n:127.0.0.1:58841__pm c:control_collection s:shard1 r:core_node1 x:collection1] o.a.s.u.p.UpdateRequestProcessorChain creating updateRequestProcessorChain "stored_sig"
   [junit4]   2> 1698256 INFO  (coreLoadExecutor-3660-thread-1-processing-n:127.0.0.1:58841__pm) [n:127.0.0.1:58841__pm c:control_collection s:shard1 r:core_node1 x:collection1] o.a.s.u.p.UpdateRequestProcessorChain inserting DistributedUpdateProcessorFactory into updateRequestProcessorChain "stored_sig"
   [junit4]   2> 1698256 INFO  (coreLoadExecutor-3660-thread-1-processing-n:127.0.0.1:58841__pm) [n:127.0.0.1:58841__pm c:control_collection s:shard1 r:core_node1 x:collection1] o.a.s.u.p.UpdateRequestProcessorChain creating updateRequestProcessorChain "distrib-dup-test-chain-explicit"
   [junit4]   2> 1698256 INFO  (coreLoadExecutor-3660-thread-1-processing-n:127.0.0.1:58841__pm) [n:127.0.0.1:58841__pm c:control_collection s:shard1 r:core_node1 x:collection1] o.a.s.u.p.UpdateRequestProcessorChain creating updateRequestProcessorChain "distrib-dup-test-chain-implicit"
   [junit4]   2> 1698257 INFO  (coreLoadExecutor-3660-thread-1-processing-n:127.0.0.1:58841__pm) [n:127.0.0.1:58841__pm c:control_collection s:shard1 r:core_node1 x:collection1] o.a.s.u.p.UpdateRequestProcessorChain inserting DistributedUpdateProcessorFactory into updateRequestProcessorChain "distrib-dup-test-chain-implicit"
   [junit4]   2> 1698257 INFO  (coreLoadExecutor-3660-thread-1-processing-n:127.0.0.1:58841__pm) [n:127.0.0.1:58841__pm c:control_collection s:shard1 r:core_node1 x:collection1] o.a.s.c.SolrCore no updateRequestProcessorChain defined as default, creating implicit default
   [junit4]   2> 1698257 WARN  (coreLoadExecutor-3660-thread-1-processing-n:127.0.0.1:58841__pm) [n:127.0.0.1:58841__pm c:control_collection s:shard1 r:core_node1 x:collection1] o.a.s.c.RequestHandlers INVALID paramSet a in requestHandler {type = requestHandler,name = /dump,class = DumpRequestHandler,args = {defaults={a=A,b=B}}}
   [junit4]   2> 1698260 INFO  (coreLoadExecutor-3660-thread-1-processing-n:127.0.0.1:58841__pm) [n:127.0.0.1:58841__pm c:control_collection s:shard1 r:core_node1 x:collection1] o.a.s.h.l.XMLLoader xsltCacheLifetimeSeconds=60
   [junit4]   2> 1698261 INFO  (coreLoadExecutor-3660-thread-1-processing-n:127.0.0.1:58841__pm) [n:127.0.0.1:58841__pm c:control_collection s:shard1 r:core_node1 x:collection1] o.a.s.h.l.XMLLoader xsltCacheLifetimeSeconds=60
   [junit4]   2> 1698263 INFO  (coreLoadExecutor-3660-thread-1-processing-n:127.0.0.1:58841__pm) [n:127.0.0.1:58841__pm c:control_collection s:shard1 r:core_node1 x:collection1] o.a.s.h.l.XMLLoader xsltCacheLifetimeSeconds=60
   [junit4]   2> 1698264 INFO  (coreLoadExecutor-3660-thread-1-processing-n:127.0.0.1:58841__pm) [n:127.0.0.1:58841__pm c:control_collection s:shard1 r:core_node1 x:collection1] o.a.s.h.l.XMLLoader xsltCacheLifetimeSeconds=60
   [junit4]   2> 1698268 INFO  (coreLoadExecutor-3660-thread-1-processing-n:127.0.0.1:58841__pm) [n:127.0.0.1:58841__pm c:control_collection s:shard1 r:core_node1 x:collection1] o.a.s.c.RequestHandlers Registered paths: /admin/logging,/admin/mbeans,/admin/file,/update/json,/admin/threads,/config,/schema,/admin/segments,/admin/plugins,/dump,standard,/admin/properties,/admin/ping,/update,/update/json/docs,/get,/replication,/admin/luke,/admin/system,/update/csv
   [junit4]   2> 1698270 INFO  (coreLoadExecutor-3660-thread-1-processing-n:127.0.0.1:58841__pm) [n:127.0.0.1:58841__pm c:control_collection s:shard1 r:core_node1 x:collection1] o.a.s.c.SolrCore Using default statsCache cache: org.apache.solr.search.stats.LocalStatsCache
   [junit4]   2> 1698271 INFO  (coreLoadExecutor-3660-thread-1-processing-n:127.0.0.1:58841__pm) [n:127.0.0.1:58841__pm c:control_collection s:shard1 r:core_node1 x:collection1] o.a.s.u.UpdateHandler Using UpdateLog implementation: org.apache.solr.update.UpdateLog
   [junit4]   2> 1698271 INFO  (coreLoadExecutor-3660-thread-1-processing-n:127.0.0.1:58841__pm) [n:127.0.0.1:58841__pm c:control_collection s:shard1 r:core_node1 x:collection1] o.a.s.u.UpdateLog Initializing UpdateLog: dataDir= defaultSyncLevel=FLUSH numRecordsToKeep=100 maxNumLogsToKeep=10 numVersionBuckets=65536
   [junit4]   2> 1698271 INFO  (coreLoadExecutor-3660-thread-1-processing-n:127.0.0.1:58841__pm) [n:127.0.0.1:58841__pm c:control_collection s:shard1 r:core_node1 x:collection1] o.a.s.u.CommitTracker Hard AutoCommit: disabled
   [junit4]   2> 1698271 INFO  (coreLoadExecutor-3660-thread-1-processing-n:127.0.0.1:58841__pm) [n:127.0.0.1:58841__pm c:control_collection s:shard1 r:core_node1 x:collection1] o.a.s.u.CommitTracker Soft AutoCommit: disabled
   [junit4]   2> 1698272 INFO  (coreLoadExecutor-3660-thread-1-processing-n:127.0.0.1:58841__pm) [n:127.0.0.1:58841__pm c:control_collection s:shard1 r:core_node1 x:collection1] o.a.s.u.RandomMergePolicy RandomMergePolicy wrapping class org.apache.lucene.index.LogDocMergePolicy: [LogDocMergePolicy: minMergeSize=1000, mergeFactor=34, maxMergeSize=9223372036854775807, maxMergeSizeForForcedMerge=9223372036854775807, calibrateSizeByDeletes=false, maxMergeDocs=2147483647, maxCFSSegmentSizeMB=0.9345703125, noCFSRatio=0.0]
   [junit4]   2> 1698272 INFO  (coreLoadExecutor-3660-thread-1-processing-n:127.0.0.1:58841__pm) [n:127.0.0.1:58841__pm c:control_collection s:shard1 r:core_node1 x:collection1] o.a.s.c.SolrDeletionPolicy SolrDeletionPolicy.onInit: commits: num=1
   [junit4]   2> 	commit{dir=MockDirectoryWrapper(RAMDirectory@9e52655 lockFactory=org.apache.lucene.store.SingleInstanceLockFactory@23379b86),segFN=segments_1,generation=1}
   [junit4]   2> 1698272 INFO  (coreLoadExecutor-3660-thread-1-processing-n:127.0.0.1:58841__pm) [n:127.0.0.1:58841__pm c:control_collection s:shard1 r:core_node1 x:collection1] o.a.s.c.SolrDeletionPolicy newest commit generation = 1
   [junit4]   2> 1698273 INFO  (coreLoadExecutor-3660-thread-1-processing-n:127.0.0.1:58841__pm) [n:127.0.0.1:58841__pm c:control_collection s:shard1 r:core_node1 x:collection1] o.a.s.s.SolrIndexSearcher Opening Searcher@6046dd8d[collection1] main
   [junit4]   2> 1698273 INFO  (coreLoadExecutor-3660-thread-1-processing-n:127.0.0.1:58841__pm) [n:127.0.0.1:58841__pm c:control_collection s:shard1 r:core_node1 x:collection1] o.a.s.c.c.ZkStateReader Load collection config from:/collections/control_collection
   [junit4]   2> 1698274 INFO  (coreLoadExecutor-3660-thread-1-processing-n:127.0.0.1:58841__pm) [n:127.0.0.1:58841__pm c:control_collection s:shard1 r:core_node1 x:collection1] o.a.s.c.c.ZkStateReader path=/collections/control_collection configName=conf1 specified config exists in ZooKeeper
   [junit4]   2> 1698274 INFO  (coreLoadExecutor-3660-thread-1-processing-n:127.0.0.1:58841__pm) [n:127.0.0.1:58841__pm c:control_collection s:shard1 r:core_node1 x:collection1] o.a.s.r.ManagedResourceStorage Setting up ZooKeeper-based storage for the RestManager with znodeBase: /configs/conf1
   [junit4]   2> 1698274 INFO  (coreLoadExecutor-3660-thread-1-processing-n:127.0.0.1:58841__pm) [n:127.0.0.1:58841__pm c:control_collection s:shard1 r:core_node1 x:collection1] o.a.s.r.ManagedResourceStorage Configured ZooKeeperStorageIO with znodeBase: /configs/conf1
   [junit4]   2> 1698274 INFO  (coreLoadExecutor-3660-thread-1-processing-n:127.0.0.1:58841__pm) [n:127.0.0.1:58841__pm c:control_collection s:shard1 r:core_node1 x:collection1] o.a.s.r.RestManager Initializing RestManager with initArgs: {}
   [junit4]   2> 1698274 INFO  (coreLoadExecutor-3660-thread-1-processing-n:127.0.0.1:58841__pm) [n:127.0.0.1:58841__pm c:control_collection s:shard1 r:core_node1 x:collection1] o.a.s.r.ManagedResourceStorage Reading _rest_managed.json using ZooKeeperStorageIO:path=/configs/conf1
   [junit4]   2> 1698275 INFO  (coreLoadExecutor-3660-thread-1-processing-n:127.0.0.1:58841__pm) [n:127.0.0.1:58841__pm c:control_collection s:shard1 r:core_node1 x:collection1] o.a.s.r.ManagedResourceStorage No data found for znode /configs/conf1/_rest_managed.json
   [junit4]   2> 1698275 INFO  (coreLoadExecutor-3660-thread-1-processing-n:127.0.0.1:58841__pm) [n:127.0.0.1:58841__pm c:control_collection s:shard1 r:core_node1 x:collection1] o.a.s.r.ManagedResourceStorage Loaded null at path _rest_managed.json using ZooKeeperStorageIO:path=/configs/conf1
   [junit4]   2> 1698275 INFO  (coreLoadExecutor-3660-thread-1-processing-n:127.0.0.1:58841__pm) [n:127.0.0.1:58841__pm c:control_collection s:shard1 r:core_node1 x:collection1] o.a.s.r.RestManager Initializing 0 registered ManagedResources
   [junit4]   2> 1698275 INFO  (coreLoadExecutor-3660-thread-1-processing-n:127.0.0.1:58841__pm) [n:127.0.0.1:58841__pm c:control_collection s:shard1 r:core_node1 x:collection1] o.a.s.h.ReplicationHandler Commits will be reserved for  10000
   [junit4]   2> 1698276 INFO  (searcherExecutor-3661-thread-1-processing-n:127.0.0.1:58841__pm s:shard1 x:collection1 r:core_node1 c:control_collection) [n:127.0.0.1:58841__pm c:control_collection s:shard1 r:core_node1 x:collection1] o.a.s.c.SolrCore [collection1] Registered new searcher Searcher@6046dd8d[collection1] main{ExitableDirectoryReader(UninvertingDirectoryReader())}
   [junit4]   2> 1698276 INFO  (coreLoadExecutor-3660-thread-1-processing-n:127.0.0.1:58841__pm) [n:127.0.0.1:58841__pm c:control_collection s:shard1 r:core_node1 x:collection1] o.a.s.u.UpdateLog Looking up max value of version field to seed version buckets
   [junit4]   2> 1698276 INFO  (coreLoadExecutor-3660-thread-1-processing-n:127.0.0.1:58841__pm) [n:127.0.0.1:58841__pm c:control_collection s:shard1 r:core_node1 x:collection1] o.a.s.u.VersionInfo Refreshing highest value of _version_ for 65536 version buckets from index
   [junit4]   2> 1698276 INFO  (coreLoadExecutor-3660-thread-1-processing-n:127.0.0.1:58841__pm) [n:127.0.0.1:58841__pm c:control_collection s:shard1 r:core_node1 x:collection1] o.a.s.u.VersionInfo No terms found for _version_, cannot seed version bucket highest value from index
   [junit4]   2> 1698276 INFO  (coreLoadExecutor-3660-thread-1-processing-n:127.0.0.1:58841__pm) [n:127.0.0.1:58841__pm c:control_collection s:shard1 r:core_node1 x:collection1] o.a.s.u.UpdateLog Could not find max version in index or recent updates, using new clock 1519986408843902976
   [junit4]   2> 1698278 INFO  (coreLoadExecutor-3660-thread-1-processing-n:127.0.0.1:58841__pm) [n:127.0.0.1:58841__pm c:control_collection s:shard1 r:core_node1 x:collection1] o.a.s.u.UpdateLog Took 2.0ms to seed version buckets with highest version 1519986408843902976
   [junit4]   2> 1698278 INFO  (coreLoadExecutor-3660-thread-1-processing-n:127.0.0.1:58841__pm) [n:127.0.0.1:58841__pm c:control_collection s:shard1 r:core_node1 x:collection1] o.a.s.c.ZkController watch zkdir /configs/conf1
   [junit4]   2> 1698279 INFO  (coreLoadExecutor-3660-thread-1-processing-n:127.0.0.1:58841__pm) [n:127.0.0.1:58841__pm c:control_collection s:shard1 r:core_node1 x:collection1] o.a.s.c.CoreContainer registering core: collection1
   [junit4]   2> 1698279 INFO  (coreZkRegister-3654-thread-1-processing-n:127.0.0.1:58841__pm s:shard1 x:collection1 r:core_node1 c:control_collection) [n:127.0.0.1:58841__pm c:control_collection s:shard1 r:core_node1 x:collection1] o.a.s.c.ZkController Register replica - core:collection1 address:http://127.0.0.1:58841/_pm collection:control_collection shard:shard1
   [junit4]   2> 1698280 INFO  (coreZkRegister-3654-thread-1-processing-n:127.0.0.1:58841__pm s:shard1 x:collection1 r:core_node1 c:control_collection) [n:127.0.0.1:58841__pm c:control_collection s:shard1 r:core_node1 x:collection1] o.a.s.c.c.SolrZkClient makePath: /collections/control_collection/leader_elect/shard1/election
   [junit4]   2> 1698284 INFO  (coreZkRegister-3654-thread-1-processing-n:127.0.0.1:58841__pm s:shard1 x:collection1 r:core_node1 c:control_collection) [n:127.0.0.1:58841__pm c:control_collection s:shard1 r:core_node1 x:collection1] o.a.s.c.LeaderElector Joined leadership election with path: /collections/control_collection/leader_elect/shard1/election/94999150421606404-core_node1-n_0000000000
   [junit4]   2> 1698284 INFO  (coreZkRegister-3654-thread-1-processing-n:127.0.0.1:58841__pm s:shard1 x:collection1 r:core_node1 c:control_collection) [n:127.0.0.1:58841__pm c:control_collection s:shard1 r:core_node1 x:collection1] o.a.s.c.ShardLeaderElectionContext Running the leader process for shard shard1
   [junit4]   2> 1698286 INFO  (coreZkRegister-3654-thread-1-processing-n:127.0.0.1:58841__pm s:shard1 x:collection1 r:core_node1 c:control_collection) [n:127.0.0.1:58841__pm c:control_collection s:shard1 r:core_node1 x:collection1] o.a.s.c.ShardLeaderElectionContext Enough replicas found to continue.
   [junit4]   2> 1698286 INFO  (coreZkRegister-3654-thread-1-processing-n:127.0.0.1:58841__pm s:shard1 x:collection1 r:core_node1 c:control_collection) [n:127.0.0.1:58841__pm c:control_collection s:shard1 r:core_node1 x:collection1] o.a.s.c.ShardLeaderElectionContext I may be the new leader - try and sync
   [junit4]   2> 1698286 INFO  (coreZkRegister-3654-thread-1-processing-n:127.0.0.1:58841__pm s:shard1 x:collection1 r:core_node1 c:control_collection) [n:127.0.0.1:58841__pm c:control_collection s:shard1 r:core_node1 x:collection1] o.a.s.c.SyncStrategy Sync replicas to http://127.0.0.1:58841/_pm/collection1/
   [junit4]   2> 1698286 INFO  (coreZkRegister-3654-thread-1-processing-n:127.0.0.1:58841__pm s:shard1 x:collection1 r:core_node1 c:control_collection) [n:127.0.0.1:58841__pm c:control_collection s:shard1 r:core_node1 x:collection1] o.a.s.c.SyncStrategy Sync Success - now sync replicas to me
   [junit4]   2> 1698287 INFO  (coreZkRegister-3654-thread-1-processing-n:127.0.0.1:58841__pm s:shard1 x:collection1 r:core_node1 c:control_collection) [n:127.0.0.1:58841__pm c:control_collection s:shard1 r:core_node1 x:collection1] o.a.s.c.SyncStrategy http://127.0.0.1:58841/_pm/collection1/ has no replicas
   [junit4]   2> 1698287 INFO  (OverseerStateUpdate-94999150421606404-127.0.0.1:58841__pm-n_0000000000) [n:127.0.0.1:58841__pm    ] o.a.s.c.Overseer processMessage: queueSize: 1, message = {
   [junit4]   2>   "operation":"leader",
   [junit4]   2>   "shard":"shard1",
   [junit4]   2>   "collection":"control_collection"} current state version: 1
   [junit4]   2> 1698288 INFO  (coreZkRegister-3654-thread-1-processing-n:127.0.0.1:58841__pm s:shard1 x:collection1 r:core_node1 c:control_collection) [n:127.0.0.1:58841__pm c:control_collection s:shard1 r:core_node1 x:collection1] o.a.s.c.c.SolrZkClient makePath: /collections/control_collection/leaders/shard1
   [junit4]   2> 1698291 INFO  (coreZkRegister-3654-thread-1-processing-n:127.0.0.1:58841__pm s:shard1 x:collection1 r:core_node1 c:control_collection) [n:127.0.0.1:58841__pm c:control_collection s:shard1 r:core_node1 x:collection1] o.a.s.c.ShardLeaderElectionContextBase Creating leader registration node
   [junit4]   2> 1698293 INFO  (coreZkRegister-3654-thread-1-processing-n:127.0.0.1:58841__pm s:shard1 x:collection1 r:core_node1 c:control_collection) [n:127.0.0.1:58841__pm c:control_collection s:shard1 r:core_node1 x:collection1] o.a.s.c.ShardLeaderElectionContext I am the new leader: http://127.0.0.1:58841/_pm/collection1/ shard1
   [junit4]   2> 1698293 INFO  (OverseerStateUpdate-94999150421606404-127.0.0.1:58841__pm-n_0000000000) [n:127.0.0.1:58841__pm    ] o.a.s.c.Overseer processMessage: queueSize: 1, message = {
   [junit4]   2>   "operation":"leader",
   [junit4]   2>   "shard":"shard1",
   [junit4]   2>   "collection":"control_collection",
   [junit4]   2>   "base_url":"http://127.0.0.1:58841/_pm",
   [junit4]   2>   "core":"collection1",
   [junit4]   2>   "state":"active"} current state version: 1
   [junit4]   2> 1698374 INFO  (TEST-CollectionsAPIDistributedZkTest.test-seed#[EB19EDDE5315287C]) [    ] o.a.s.c.c.SolrZkClient Using default ZkCredentialsProvider
   [junit4]   2> 1698375 INFO  (TEST-CollectionsAPIDistributedZkTest.test-seed#[EB19EDDE5315287C]) [    ] o.a.s.c.c.ConnectionManager Waiting for client to connect to ZooKeeper
   [junit4]   2> 1698377 INFO  (zkCallback-1079-thread-1) [    ] o.a.s.c.c.ConnectionManager Watcher org.apache.solr.common.cloud.ConnectionManager@2780fd5e name:ZooKeeperConnection Watcher:127.0.0.1:43566/solr got event WatchedEvent state:SyncConnected type:None path:null path:null type:None
   [junit4]   2> 1698377 INFO  (TEST-CollectionsAPIDistributedZkTest.test-seed#[EB19EDDE5315287C]) [    ] o.a.s.c.c.ConnectionManager Client is connected to ZooKeeper
   [junit4]   2> 1698377 INFO  (TEST-CollectionsAPIDistributedZkTest.test-seed#[EB19EDDE5315287C]) [    ] o.a.s.c.c.SolrZkClient Using default ZkACLProvider
   [junit4]   2> 1698377 INFO  (TEST-CollectionsAPIDistributedZkTest.test-seed#[EB19EDDE5315287C]) [    ] o.a.s.c.c.ZkStateReader Updating cluster state from ZooKeeper... 
   [junit4]   2> 1698380 INFO  (TEST-CollectionsAPIDistributedZkTest.test-seed#[EB19EDDE5315287C]) [    ] o.a.s.c.ChaosMonkey monkey: init - expire sessions:false cause connection loss:false
   [junit4]   2> 1698380 INFO  (TEST-CollectionsAPIDistributedZkTest.test-seed#[EB19EDDE5315287C]) [    ] o.a.s.c.AbstractFullDistribZkTestBase Creating collection1 with stateFormat=2
   [junit4]   2> 1698380 INFO  (TEST-CollectionsAPIDistributedZkTest.test-seed#[EB19EDDE5315287C]) [    ] o.a.s.c.c.SolrZkClient Using default ZkCredentialsProvider
   [junit4]   2> 1698380 INFO  (TEST-CollectionsAPIDistributedZkTest.test-seed#[EB19EDDE5315287C]) [    ] o.a.s.c.c.ConnectionManager Waiting for client to connect to ZooKeeper
   [junit4]   2> 1698382 INFO  (zkCallback-1080-thread-1) [    ] o.a.s.c.c.ConnectionManager Watcher org.apache.solr.common.cloud.ConnectionManager@32b4051c name:ZooKeeperConnection Watcher:127.0.0.1:43566/solr got event WatchedEvent state:SyncConnected type:None path:null path:null type:None
   [junit4]   2> 1698382 INFO  (TEST-CollectionsAPIDistributedZkTest.test-seed#[EB19EDDE5315287C]) [    ] o.a.s.c.c.ConnectionManager Client is connected to ZooKeeper
   [junit4]   2> 1698382 INFO  (TEST-CollectionsAPIDistributedZkTest.test-seed#[EB19EDDE5315287C]) [    ] o.a.s.c.c.SolrZkClient Using default ZkACLProvider
   [junit4]   2> 1698385 INFO  (OverseerStateUpdate-94999150421606404-127.0.0.1:58841__pm-n_0000000000) [n:127.0.0.1:58841__pm    ] o.a.s.c.Overseer processMessage: queueSize: 1, message = {
   [junit4]   2>   "operation":"create",
   [junit4]   2>   "name":"collection1",
   [junit4]   2>   "numShards":"2",
   [junit4]   2>   "stateFormat":"2"} current state version: 1
   [junit4]   2> 1698385 INFO  (OverseerStateUpdate-94999150421606404-127.0.0.1:58841__pm-n_0000000000) [n:127.0.0.1:58841__pm    ] o.a.s.c.o.ClusterStateMutator building a new cName: collection1
   [junit4]   2> 1698385 INFO  (zkCallback-1077-thread-1-processing-n:127.0.0.1:58841__pm) [n:127.0.0.1:58841__pm    ] o.a.s.c.c.ZkStateReader A cluster state change: WatchedEvent state:SyncConnected type:NodeDataChanged path:/clusterstate.json, has occurred - updating... (live nodes size: 1)
   [junit4]   2> 1698385 INFO  (zkCallback-1079-thread-1) [    ] o.a.s.c.c.ZkStateReader A cluster state change: WatchedEvent state:SyncConnected type:NodeDataChanged path:/clusterstate.json, has occurred - updating... (live nodes size: 1)
   [junit4]   2> 1698394 INFO  (coreZkRegister-3654-thread-1-processing-n:127.0.0.1:58841__pm s:shard1 x:collection1 r:core_node1 c:control_collection) [n:127.0.0.1:58841__pm c:control_collection s:shard1 r:core_node1 x:collection1] o.a.s.c.ZkController We are http://127.0.0.1:58841/_pm/collection1/ and leader is http://127.0.0.1:58841/_pm/collection1/
   [junit4]   2> 1698394 INFO  (coreZkRegister-3654-thread-1-processing-n:127.0.0.1:58841__pm s:shard1 x:collection1 r:core_node1 c:control_collection) [n:127.0.0.1:58841__pm c:control_collection s:shard1 r:core_node1 x:collection1] o.a.s.c.ZkController No LogReplay needed for core=collection1 baseURL=http://127.0.0.1:58841/_pm
   [junit4]   2> 1698394 INFO  (coreZkRegister-3654-thread-1-processing-n:127.0.0.1:58841__pm s:shard1 x:collection1 r:core_node1 c:control_collection) [n:127.0.0.1:58841__pm c:control_collection s:shard1 r:core_node1 x:collection1] o.a.s.c.ZkController I am the leader, no recovery necessary
   [junit4]   2> 1698394 INFO  (coreZkRegister-3654-thread-1-processing-n:127.0.0.1:58841__pm s:shard1 x:collection1 r:core_node1 c:control_collection) [n:127.0.0.1:58841__pm c:control_collection s:shard1 r:core_node1 x:collection1] o.a.s.c.ZkController publishing state=active
   [junit4]   2> 1698394 INFO  (coreZkRegister-3654-thread-1-processing-n:127.0.0.1:58841__pm s:shard1 x:collection1 r:core_node1 c:control_collection) [n:127.0.0.1:58841__pm c:control_collection s:shard1 r:core_node1 x:collection1] o.a.s.c.ZkController numShards not found on descriptor - reading it from system property
   [junit4]   2> 1698396 INFO  (OverseerStateUpdate-94999150421606404-127.0.0.1:58841__pm-n_0000000000) [n:127.0.0.1:58841__pm    ] o.a.s.c.Overseer processMessage: queueSize: 1, message = {
   [junit4]   2>   "shard":"shard1",
   [junit4]   2>   "node_name":"127.0.0.1:58841__pm",
   [junit4]   2>   "base_url":"http://127.0.0.1:58841/_pm",
   [junit4]   2>   "roles":null,
   [junit4]   2>   "core":"collection1",
   [junit4]   2>   "collection":"control_collection",
   [junit4]   2>   "core_node_name":"core_node1",
   [junit4]   2>   "numShards":"2",
   [junit4]   2>   "operation":"state",
   [junit4]   2>   "state":"active"} current state version: 2
   [junit4]   2> 1698397 INFO  (OverseerStateUpdate-94999150421606404-127.0.0.1:58841__pm-n_0000000000) [n:127.0.0.1:58841__pm    ] o.a.s.c.o.ReplicaMutator Update state numShards=2 message={
   [junit4]   2>   "shard":"shard1",
   [junit4]   2>   "node_name":"127.0.0.1:58841__pm",
   [junit4]   2>   "base_url":"http://127.0.0.1:58841/_pm",
   [junit4]   2>   "roles":null,
   [junit4]   2>   "core":"collection1",
   [junit4]   2>   "collection":"control_collection",
   [junit4]   2>   "core_node_name":"core_node1",
   [junit4]   2>   "numShards":"2",
   [junit4]   2>   "operation":"state",
   [junit4]   2>   "state":"active"}
   [junit4]   2> 1698398 INFO  (OverseerStateUpdate-94999150421606404-127.0.0.1:58841__pm-n_0000000000) [n:127.0.0.1:58841__pm    ] o.a.s.c.o.ZkStateWriter going to create_collection /collections/collection1/state.json
   [junit4]   2> 1698502 INFO  (zkCallback-1079-thread-1) [    ] o.a.s.c.c.ZkStateReader A cluster state change: WatchedEvent state:SyncConnected type:NodeDataChanged path:/clusterstate.json, has occurred - updating... (live nodes size: 1)
   [junit4]   2> 1698503 INFO  (zkCallback-1077-thread-1-processing-n:127.0.0.1:58841__pm) [n:127.0.0.1:58841__pm    ] o.a.s.c.c.ZkStateReader A cluster state change: WatchedEvent state:SyncConnected type:NodeDataChanged path:/clusterstate.json, has occurred - updating... (live nodes size: 1)
   [junit4]   2> 1698722 INFO  (TEST-CollectionsAPIDistributedZkTest.test-seed#[EB19EDDE5315287C]) [    ] o.a.s.SolrTestCaseJ4 Writing core.properties file to /x1/jenkins/jenkins-slave/workspace/Lucene-Solr-NightlyTests-5.4/solr/build/solr-core/test/J0/temp/solr.cloud.CollectionsAPIDistributedZkTest_EB19EDDE5315287C-001/shard-1-001/cores/collection1
   [junit4]   2> 1698723 INFO  (TEST-CollectionsAPIDistributedZkTest.test-seed#[EB19EDDE5315287C]) [    ] o.a.s.c.AbstractFullDistribZkTestBase create jetty 1 in directory /x1/jenkins/jenkins-slave/workspace/Lucene-Solr-NightlyTests-5.4/solr/build/solr-core/test/J0/temp/solr.cloud.CollectionsAPIDistributedZkTest_EB19EDDE5315287C-001/shard-1-001
   [junit4]   2> 1698724 INFO  (TEST-CollectionsAPIDistributedZkTest.test-seed#[EB19EDDE5315287C]) [    ] o.e.j.s.Server jetty-9.2.13.v20150730
   [junit4]   2> 1698726 INFO  (TEST-CollectionsAPIDistributedZkTest.test-seed#[EB19EDDE5315287C]) [    ] o.e.j.s.h.ContextHandler Started o.e.j.s.ServletContextHandler@e1146f7{/_pm,null,AVAILABLE}
   [junit4]   2> 1698727 INFO  (TEST-CollectionsAPIDistributedZkTest.test-seed#[EB19EDDE5315287C]) [    ] o.e.j.s.ServerConnector Started ServerConnector@6cab78c2{HTTP/1.1}{127.0.0.1:39299}
   [junit4]   2> 1698727 INFO  (TEST-CollectionsAPIDistributedZkTest.test-seed#[EB19EDDE5315287C]) [    ] o.e.j.s.Server Started @1701506ms
   [junit4]   2> 1698727 INFO  (TEST-CollectionsAPIDistributedZkTest.test-seed#[EB19EDDE5315287C]) [    ] o.a.s.c.s.e.JettySolrRunner Jetty properties: {coreRootDirectory=/x1/jenkins/jenkins-slave/workspace/Lucene-Solr-NightlyTests-5.4/solr/build/solr-core/test/J0/temp/solr.cloud.CollectionsAPIDistributedZkTest_EB19EDDE5315287C-001/shard-1-001/cores, hostContext=/_pm, hostPort=39299, solrconfig=solrconfig.xml, solr.data.dir=/x1/jenkins/jenkins-slave/workspace/Lucene-Solr-NightlyTests-5.4/solr/build/solr-core/test/J0/temp/solr.cloud.CollectionsAPIDistributedZkTest_EB19EDDE5315287C-001/tempDir-001/jetty1}
   [junit4]   2> 1698727 INFO  (TEST-CollectionsAPIDistributedZkTest.test-seed#[EB19EDDE5315287C]) [    ] o.a.s.s.SolrDispatchFilter SolrDispatchFilter.init(): sun.misc.Launcher$AppClassLoader@7b3cb2c6
   [junit4]   2> 1698727 INFO  (TEST-CollectionsAPIDistributedZkTest.test-seed#[EB19EDDE5315287C]) [    ] o.a.s.c.SolrResourceLoader new SolrResourceLoader for directory: '/x1/jenkins/jenkins-slave/workspace/Lucene-Solr-NightlyTests-5.4/solr/build/solr-core/test/J0/temp/solr.cloud.CollectionsAPIDistributedZkTest_EB19EDDE5315287C-001/shard-1-001'
   [junit4]   2> 1698727 INFO  (TEST-CollectionsAPIDistributedZkTest.test-seed#[EB19EDDE5315287C]) [    ] o.a.s.c.SolrResourceLoader JNDI not configured for solr (NoInitialContextEx)
   [junit4]   2> 1698727 INFO  (TEST-CollectionsAPIDistributedZkTest.test-seed#[EB19EDDE5315287C]) [    ] o.a.s.c.SolrResourceLoader solr home defaulted to 'solr/' (could not find system property or JNDI)
   [junit4]   2> 1698728 INFO  (TEST-CollectionsAPIDistributedZkTest.test-seed#[EB19EDDE5315287C]) [    ] o.a.s.c.c.SolrZkClient Using default ZkCredentialsProvider
   [junit4]   2> 1698728 INFO  (TEST-CollectionsAPIDistributedZkTest.test-seed#[EB19EDDE5315287C]) [    ] o.a.s.c.c.ConnectionManager Waiting for client to connect to ZooKeeper
   [junit4]   2> 1698730 INFO  (zkCallback-1081-thread-1) [    ] o.a.s.c.c.ConnectionManager Watcher org.apache.solr.common.cloud.ConnectionManager@1d485865 name:ZooKeeperConnection Watcher:127.0.0.1:43566/solr got event WatchedEvent state:SyncConnected type:None path:null path:null type:None
   [junit4]   2> 1698730 INFO  (TEST-CollectionsAPIDistributedZkTest.test-seed#[EB19EDDE5315287C]) [    ] o.a.s.c.c.ConnectionManager Client is connected to ZooKeeper
   [junit4]   2> 1698731 INFO  (TEST-CollectionsAPIDistributedZkTest.test-seed#[EB19EDDE5315287C]) [    ] o.a.s.c.c.SolrZkClient Using default ZkACLProvider
   [junit4]   2> 1698732 INFO  (TEST-CollectionsAPIDistributedZkTest.test-seed#[EB19EDDE5315287C]) [    ] o.a.s.s.SolrDispatchFilter Loading solr.xml from SolrHome (not found in ZooKeeper)
   [junit4]   2> 1698732 INFO  (TEST-CollectionsAPIDistributedZkTest.test-seed#[EB19EDDE5315287C]) [    ] o.a.s.c.SolrXmlConfig Loading container configuration from /x1/jenkins/jenkins-slave/workspace/Lucene-Solr-NightlyTests-5.4/solr/build/solr-core/test/J0/temp/solr.cloud.CollectionsAPIDistributedZkTest_EB19EDDE5315287C-001/shard-1-001/solr.xml
   [junit4]   2> 1698748 INFO  (TEST-CollectionsAPIDistributedZkTest.test-seed#[EB19EDDE5315287C]) [    ] o.a.s.c.CorePropertiesLocator Config-defined core root directory: /x1/jenkins/jenkins-slave/workspace/Lucene-Solr-NightlyTests-5.4/solr/build/solr-core/test/J0/temp/solr.cloud.CollectionsAPIDistributedZkTest_EB19EDDE5315287C-001/shard-1-001/cores
   [junit4]   2> 1698748 INFO  (TEST-CollectionsAPIDistributedZkTest.test-seed#[EB19EDDE5315287C]) [    ] o.a.s.c.CoreContainer New CoreContainer 400473856
   [junit4]   2> 1698748 INFO  (TEST-CollectionsAPIDistributedZkTest.test-seed#[EB19EDDE5315287C]) [    ] o.a.s.c.CoreContainer Loading cores into CoreContainer [instanceDir=/x1/jenkins/jenkins-slave/workspace/Lucene-Solr-NightlyTests-5.4/solr/build/solr-core/test/J0/temp/solr.cloud.CollectionsAPIDistributedZkTest_EB19EDDE5315287C-001/shard-1-001]
   [junit4]   2> 1698748 WARN  (TEST-CollectionsAPIDistributedZkTest.test-seed#[EB19EDDE5315287C]) [    ] o.a.s.c.CoreContainer Couldn't add files from /x1/jenkins/jenkins-slave/workspace/Lucene-Solr-NightlyTests-5.4/solr/build/solr-core/test/J0/temp/solr.cloud.CollectionsAPIDistributedZkTest_EB19EDDE5315287C-001/shard-1-001/lib to classpath: /x1/jenkins/jenkins-slave/workspace/Lucene-Solr-NightlyTests-5.4/solr/build/solr-core/test/J0/temp/solr.cloud.CollectionsAPIDistributedZkTest_EB19EDDE5315287C-001/shard-1-001/lib
   [junit4]   2> 1698748 INFO  (TEST-CollectionsAPIDistributedZkTest.test-seed#[EB19EDDE5315287C]) [    ] o.a.s.h.c.HttpShardHandlerFactory created with socketTimeout : 90000,urlScheme : ,connTimeout : 15000,maxConnectionsPerHost : 20,maxConnections : 10000,corePoolSize : 0,maximumPoolSize : 2147483647,maxThreadIdleTime : 5,sizeOfQueue : -1,fairnessPolicy : false,useRetries : false,
   [junit4]   2> 1698750 INFO  (TEST-CollectionsAPIDistributedZkTest.test-seed#[EB19EDDE5315287C]) [    ] o.a.s.u.UpdateShardHandler Creating UpdateShardHandler HTTP client with params: socketTimeout=340000&connTimeout=45000&retry=true
   [junit4]   2> 1698750 INFO  (TEST-CollectionsAPIDistributedZkTest.test-seed#[EB19EDDE5315287C]) [    ] o.a.s.l.LogWatcher SLF4J impl is org.slf4j.impl.Log4jLoggerFactory
   [junit4]   2> 1698750 INFO  (TEST-CollectionsAPIDistributedZkTest.test-seed#[EB19EDDE5315287C]) [    ] o.a.s.l.LogWatcher Registering Log Listener [Log4j (org.slf4j.impl.Log4jLoggerFactory)]
   [junit4]   2> 1698750 INFO  (TEST-CollectionsAPIDistributedZkTest.test-seed#[EB19EDDE5315287C]) [    ] o.a.s.c.ZkContainer Zookeeper client=127.0.0.1:43566/solr
   [junit4]   2> 1698751 INFO  (TEST-CollectionsAPIDistributedZkTest.test-seed#[EB19EDDE5315287C]) [    ] o.a.s.c.ZkController zkHost includes chroot
   [junit4]   2> 1698751 INFO  (TEST-CollectionsAPIDistributedZkTest.test-seed#[EB19EDDE5315287C]) [    ] o.a.s.c.c.SolrZkClient Using default ZkCredentialsProvider
   [junit4]   2> 1698751 INFO  (TEST-CollectionsAPIDistributedZkTest.test-seed#[EB19EDDE5315287C]) [    ] o.a.s.c.c.ConnectionManager Waiting for client to connect to ZooKeeper
   [junit4]   2> 1698753 INFO  (zkCallback-1083-thread-1) [    ] o.a.s.c.c.ConnectionManager Watcher org.apache.solr.common.cloud.ConnectionManager@7974d606 name:ZooKeeperConnection Watcher:127.0.0.1:43566 got event WatchedEvent state:SyncConnected type:None path:null path:null type:None
   [junit4]   2> 1698753 INFO  (TEST-CollectionsAPIDistributedZkTest.test-seed#[EB19EDDE5315287C]) [    ] o.a.s.c.c.ConnectionManager Client is connected to ZooKeeper
   [junit4]   2> 1698753 INFO  (TEST-CollectionsAPIDistributedZkTest.test-seed#[EB19EDDE5315287C]) [    ] o.a.s.c.c.SolrZkClient Using default ZkACLProvider
   [junit4]   2> 1698755 INFO  (TEST-CollectionsAPIDistributedZkTest.test-seed#[EB19EDDE5315287C]) [n:127.0.0.1:39299__pm    ] o.a.s.c.c.ConnectionManager Waiting for client to connect to ZooKeeper
   [junit4]   2> 1698756 INFO  (zkCallback-1084-thread-1-processing-n:127.0.0.1:39299__pm) [n:127.0.0.1:39299__pm    ] o.a.s.c.c.ConnectionManager Watcher org.apache.solr.common.cloud.ConnectionManager@440c8902 name:ZooKeeperConnection Watcher:127.0.0.1:43566/solr got event WatchedEvent state:SyncConnected type:None path:null path:null type:None
   [junit4]   2> 1698756 INFO  (TEST-CollectionsAPIDistributedZkTest.test-seed#[EB19EDDE5315287C]) [n:127.0.0.1:39299__pm    ] o.a.s.c.c.ConnectionManager Client is connected to ZooKeeper
   [junit4]   2> 1698763 INFO  (TEST-CollectionsAPIDistributedZkTest.test-seed#[EB19EDDE5315287C]) [n:127.0.0.1:39299__pm    ] o.a.s.c.c.ZkStateReader Updating cluster state from ZooKeeper... 
   [junit4]   2> 1699772 INFO  (TEST-CollectionsAPIDistributedZkTest.test-seed#[EB19EDDE5315287C]) [n:127.0.0.1:39299__pm    ] o.a.s.c.ZkController Register node as live in ZooKeeper:/live_nodes/127.0.0.1:39299__pm
   [junit4]   2> 1699773 INFO  (TEST-CollectionsAPIDistributedZkTest.test-seed#[EB19EDDE5315287C]) [n:127.0.0.1:39299__pm    ] o.a.s.c.c.SolrZkClient makePath: /live_nodes/127.0.0.1:39299__pm
   [junit4]   2> 1699774 INFO  (zkCallback-1079-thread-1) [    ] o.a.s.c.c.ZkStateReader A live node change: WatchedEvent state:SyncConnected type:NodeChildrenChanged path:/live_nodes, has occurred - updating... (live nodes size: 1)
   [junit4]   2> 1699775 INFO  (zkCallback-1077-thread-2-processing-n:127.0.0.1:58841__pm) [n:127.0.0.1:58841__pm    ] o.a.s.c.c.ZkStateReader A live node change: WatchedEvent state:SyncConnected type:NodeChildrenChanged path:/live_nodes, has occurred - updating... (live nodes size: 1)
   [junit4]   2> 1699775 INFO  (zkCallback-1084-thread-1-processing-n:127.0.0.1:39299__pm) [n:127.0.0.1:39299__pm    ] o.a.s.c.c.ZkStateReader A live node change: WatchedEvent state:SyncConnected type:NodeChildrenChanged path:/live_nodes, has occurred - updating... (live nodes size: 1)
   [junit4]   2> 1699776 INFO  (TEST-CollectionsAPIDistributedZkTest.test-seed#[EB19EDDE5315287C]) [n:127.0.0.1:39299__pm    ] o.a.s.c.Overseer Overseer (id=null) closing
   [junit4]   2> 1699778 INFO  (TEST-CollectionsAPIDistributedZkTest.test-seed#[EB19EDDE5315287C]) [n:127.0.0.1:39299__pm    ] o.a.s.c.LeaderElector Joined leadership election with path: /overseer_elect/election/94999150421606409-127.0.0.1:39299__pm-n_0000000001
   [junit4]   2> 1699778 INFO  (TEST-CollectionsAPIDistributedZkTest.test-seed#[EB19EDDE5315287C]) [n:127.0.0.1:39299__pm    ] o.a.s.c.LeaderElector Watching path /overseer_elect/election/94999150421606404-127.0.0.1:58841__pm-n_0000000000 to know if I could be the leader
   [junit4]   2> 1699790 INFO  (TEST-CollectionsAPIDistributedZkTest.test-seed#[EB19EDDE5315287C]) [n:127.0.0.1:39299__pm    ] o.a.s.c.CoreContainer Security conf doesn't exist. Skipping setup for authorization module.
   [junit4]   2> 1699790 INFO  (TEST-CollectionsAPIDistributedZkTest.test-seed#[EB19EDDE5315287C]) [n:127.0.0.1:39299__pm    ] o.a.s.c.CoreContainer No authentication plugin used.
   [junit4]   2> 1699791 INFO  (TEST-CollectionsAPIDistributedZkTest.test-seed#[EB19EDDE5315287C]) [n:127.0.0.1:39299__pm    ] o.a.s.c.CorePropertiesLocator Looking for core definitions underneath /x1/jenkins/jenkins-slave/workspace/Lucene-Solr-NightlyTests-5.4/solr/build/solr-core/test/J0/temp/solr.cloud.CollectionsAPIDistributedZkTest_EB19EDDE5315287C-001/shard-1-001/cores
   [junit4]   2> 1699792 INFO  (TEST-CollectionsAPIDistributedZkTest.test-seed#[EB19EDDE5315287C]) [n:127.0.0.1:39299__pm    ] o.a.s.c.CoreDescriptor Created CoreDescriptor: {absoluteInstDir=/x1/jenkins/jenkins-slave/workspace/Lucene-Solr-NightlyTests-5.4/solr/build/solr-core/test/J0/temp/solr.cloud.CollectionsAPIDistributedZkTest_EB19EDDE5315287C-001/shard-1-001/cores/collection1/, dataDir=data/, collection=collection1, name=collection1, loadOnStartup=true, instanceDir=/x1/jenkins/jenkins-slave/workspace/Lucene-Solr-NightlyTests-5.4/solr/build/solr-core/test/J0/temp/solr.cloud.CollectionsAPIDistributedZkTest_EB19EDDE5315287C-001/shard-1-001/cores/collection1, config=solrconfig.xml, transient=false, configSetProperties=configsetprops.json, coreNodeName=, schema=schema.xml, shard=}
   [junit4]   2> 1699792 INFO  (TEST-CollectionsAPIDistributedZkTest.test-seed#[EB19EDDE5315287C]) [n:127.0.0.1:39299__pm    ] o.a.s.c.CorePropertiesLocator Found core collection1 in /x1/jenkins/jenkins-slave/workspace/Lucene-Solr-NightlyTests-5.4/solr/build/solr-core/test/J0/temp/solr.cloud.CollectionsAPIDistributedZkTest_EB19EDDE5315287C-001/shard-1-001/cores/collection1/
   [junit4]   2> 1699792 INFO  (TEST-CollectionsAPIDistributedZkTest.test-seed#[EB19EDDE5315287C]) [n:127.0.0.1:39299__pm    ] o.a.s.c.CorePropertiesLocator Found 1 core definitions
   [junit4]   2> 1699793 INFO  (TEST-CollectionsAPIDistributedZkTest.test-seed#[EB19EDDE5315287C]) [n:127.0.0.1:39299__pm    ] o.a.s.s.SolrDispatchFilter user.dir=/x1/jenkins/jenkins-slave/workspace/Lucene-Solr-NightlyTests-5.4/solr/build/solr-core/test/J0
   [junit4]   2> 1699793 INFO  (TEST-CollectionsAPIDistributedZkTest.test-seed#[EB19EDDE5315287C]) [n:127.0.0.1:39299__pm    ] o.a.s.s.SolrDispatchFilter SolrDispatchFilter.init() done
   [junit4]   2> 1699794 INFO  (coreLoadExecutor-3671-thread-1-processing-n:127.0.0.1:39299__pm) [n:127.0.0.1:39299__pm c:collection1   x:collection1] o.a.s.c.ZkController publishing state=down
   [junit4]   2> 1699794 INFO  (coreLoadExecutor-3671-thread-1-processing-n:127.0.0.1:39299__pm) [n:127.0.0.1:39299__pm c:collection1   x:collection1] o.a.s.c.ZkController numShards not found on descriptor - reading it from system property
   [junit4]   2> 1699795 INFO  (coreLoadExecutor-3671-thread-1-processing-n:127.0.0.1:39299__pm) [n:127.0.0.1:39299__pm c:collection1   x:collection1] o.a.s.c.ZkController Registering watch for collection collection1
   [junit4]   2> 1699796 INFO  (coreLoadExecutor-3671-thread-1-processing-n:127.0.0.1:39299__pm) [n:127.0.0.1:39299__pm c:collection1   x:collection1] o.a.s.c.c.ZkStateReader addZkWatch collection1
   [junit4]   2> 1699796 INFO  (OverseerStateUpdate-94999150421606404-127.0.0.1:58841__pm-n_0000000000) [n:127.0.0.1:58841__pm    ] o.a.s.c.Overseer processMessage: queueSize: 1, message = {
   [junit4]   2>   "shard":null,
   [junit4]   2>   "node_name":"127.0.0.1:39299__pm",
   [junit4]   2>   "base_url":"http://127.0.0.1:39299/_pm",
   [junit4]   2>   "roles":null,
   [junit4]   2>   "core":"collection1",
   [junit4]   2>   "collection":"collection1",
   [junit4]   2>   "numShards":"2",
   [junit4]   2>   "operation":"state",
   [junit4]   2>   "state":"down"} current state version: 3
   [junit4]   2> 1699796 INFO  (coreLoadExecutor-3671-thread-1-processing-n:127.0.0.1:39299__pm) [n:127.0.0.1:39299__pm c:collection1   x:collection1] o.a.s.c.c.ZkStateReader Add data for collection1 ver 0 
   [junit4]   2> 1699796 INFO  (coreLoadExecutor-3671-thread-1-processing-n:127.0.0.1:39299__pm) [n:127.0.0.1:39299__pm c:collection1   x:collection1] o.a.s.c.ZkController look for our core node name
   [junit4]   2> 1699797 INFO  (OverseerStateUpdate-94999150421606404-127.0.0.1:58841__pm-n_0000000000) [n:127.0.0.1:58841__pm    ] o.a.s.c.o.ReplicaMutator Update state numShards=2 message={
   [junit4]   2>   "shard":null,
   [junit4]   2>   "node_name":"127.0.0.1:39299__pm",
   [junit4]   2>   "base_url":"http://127.0.0.1:39299/_pm",
   [junit4]   2>   "roles":null,
   [junit4]   2>   "core":"collection1",
   [junit4]   2>   "collection":"collection1",
   [junit4]   2>   "numShards":"2",
   [junit4]   2>   "operation":"state",
   [junit4]   2>   "state":"down"}
   [junit4]   2> 1699797 INFO  (OverseerStateUpdate-94999150421606404-127.0.0.1:58841__pm-n_0000000000) [n:127.0.0.1:58841__pm    ] o.a.s.c.o.ReplicaMutator Collection already exists with numShards=2
   [junit4]   2> 1699797 INFO  (OverseerStateUpdate-94999150421606404-127.0.0.1:58841__pm-n_0000000000) [n:127.0.0.1:58841__pm    ] o.a.s.c.o.ReplicaMutator Assigning new node to shard shard=shard2
   [junit4]   2> 1699900 INFO  (OverseerStateUpdate-94999150421606404-127.0.0.1:58841__pm-n_0000000000) [n:127.0.0.1:58841__pm    ] o.a.s.c.o.ZkStateWriter going to update_collection /collections/collection1/state.json version: 0
   [junit4]   2> 1699901 INFO  (zkCallback-1084-thread-1-processing-n:127.0.0.1:39299__pm) [n:127.0.0.1:39299__pm    ] o.a.s.c.c.ZkStateReader A cluster state change: WatchedEvent state:SyncConnected type:NodeDataChanged path:/collections/collection1/state.json for collection collection1 has occurred - updating... (live nodes size: 2)
   [junit4]   2> 1699901 INFO  (zkCallback-1084-thread-1-processing-n:127.0.0.1:39299__pm) [n:127.0.0.1:39299__pm    ] o.a.s.c.c.ZkStateReader Updating data for collection1 from 0 to 1 
   [junit4]   2> 1700796 INFO  (coreLoadExecutor-3671-thread-1-processing-n:127.0.0.1:39299__pm) [n:127.0.0.1:39299__pm c:collection1   x:collection1] o.a.s.c.ZkController waiting to find shard id in clusterstate for collection1
   [junit4]   2> 1700797 INFO  (coreLoadExecutor-3671-thread-1-processing-n:127.0.0.1:39299__pm) [n:127.0.0.1:39299__pm c:collection1   x:collection1] o.a.s.c.ZkController Check for collection zkNode:collection1
   [junit4]   2> 1700797 INFO  (coreLoadExecutor-3671-thread-1-processing-n:127.0.0.1:39299__pm) [n:127.0.0.1:39299__pm c:collection1   x:collection1] o.a.s.c.ZkController Collection zkNode exists
   [junit4]   2> 1700797 INFO  (coreLoadExecutor-3671-thread-1-processing-n:127.0.0.1:39299__pm) [n:127.0.0.1:39299__pm c:collection1   x:collection1] o.a.s.c.c.ZkStateReader Load collection config from:/collections/collection1
   [junit4]   2> 1700798 INFO  (coreLoadExecutor-3671-thread-1-processing-n:127.0.0.1:39299__pm) [n:127.0.0.1:39299__pm c:collection1   x:collection1] o.a.s.c.c.ZkStateReader path=/collections/collection1 configName=conf1 specified config exists in ZooKeeper
   [junit4]   2> 1700798 INFO  (coreLoadExecutor-3671-thread-1-processing-n:127.0.0.1:39299__pm) [n:127.0.0.1:39299__pm c:collection1   x:collection1] o.a.s.c.SolrResourceLoader new SolrResourceLoader for directory: '/x1/jenkins/jenkins-slave/workspace/Lucene-Solr-NightlyTests-5.4/solr/build/solr-core/test/J0/temp/solr.cloud.CollectionsAPIDistributedZkTest_EB19EDDE5315287C-001/shard-1-001/cores/collection1'
   [junit4]   2> 1700798 INFO  (coreLoadExecutor-3671-thread-1-processing-n:127.0.0.1:39299__pm) [n:127.0.0.1:39299__pm c:collection1   x:collection1] o.a.s.c.SolrResourceLoader JNDI not configured for solr (NoInitialContextEx)
   [junit4]   2> 1700798 INFO  (coreLoadExecutor-3671-thread-1-processing-n:127.0.0.1:39299__pm) [n:127.0.0.1:39299__pm c:collection1   x:collection1] o.a.s.c.SolrResourceLoader solr home defaulted to 'solr/' (could not find system property or JNDI)
   [junit4]   2> 1700800 INFO  (coreLoadExecutor-3671-thread-1-processing-n:127.0.0.1:39299__pm) [n:127.0.0.1:39299__pm c:collection1   x:collection1] o.a.s.c.Config loaded config solrconfig.xml with version 0 
   [junit4]   2> 1700807 INFO  (coreLoadExecutor-3671-thread-1-processing-n:127.0.0.1:39299__pm) [n:127.0.0.1:39299__pm c:collection1   x:collection1] o.a.s.c.SolrConfig current version of requestparams : -1
   [junit4]   2> 1700837 INFO  (coreLoadExecutor-3671-thread-1-processing-n:127.0.0.1:39299__pm) [n:127.0.0.1:39299__pm c:collection1   x:collection1] o.a.s.c.SolrConfig Using Lucene MatchVersion: 5.4.0
   [junit4]   2> 1700870 INFO  (coreLoadExecutor-3671-thread-1-processing-n:127.0.0.1:39299__pm) [n:127.0.0.1:39299__pm c:collection1   x:collection1] o.a.s.c.SolrConfig Loaded SolrConfig: solrconfig.xml
   [junit4]   2> 1700879 INFO  (coreLoadExecutor-3671-thread-1-processing-n:127.0.0.1:39299__pm) [n:127.0.0.1:39299__pm c:collection1   x:collection1] o.a.s.s.IndexSchema [collection1] Schema name=test
   [junit4]   2> 1701161 INFO  (coreLoadExecutor-3671-thread-1-processing-n:127.0.0.1:39299__pm) [n:127.0.0.1:39299__pm c:collection1   x:collection1] o.a.s.s.OpenExchangeRatesOrgProvider Initialized with rates=open-exchange-rates.json, refreshInterval=1440.
   [junit4]   2> 1701170 INFO  (coreLoadExecutor-3671-thread-1-processing-n:127.0.0.1:39299__pm) [n:127.0.0.1:39299__pm c:collection1   x:collection1] o.a.s.s.IndexSchema default search field in schema is text
   [junit4]   2> 1701172 INFO  (coreLoadExecutor-3671-thread-1-processing-n:127.0.0.1:39299__pm) [n:127.0.0.1:39299__pm c:collection1   x:collection1] o.a.s.s.IndexSchema unique key field: id
   [junit4]   2> 1701185 INFO  (coreLoadExecutor-3671-thread-1-processing-n:127.0.0.1:39299__pm) [n:127.0.0.1:39299__pm c:collection1   x:collection1] o.a.s.s.FileExchangeRateProvider Reloading exchange rates from file currency.xml
   [junit4]   2> 1701189 INFO  (coreLoadExecutor-3671-thread-1-processing-n:127.0.0.1:39299__pm) [n:127.0.0.1:39299__pm c:collection1   x:collection1] o.a.s.s.FileExchangeRateProvider Reloading exchange rates from file currency.xml
   [junit4]   2> 1701192 INFO  (coreLoadExecutor-3671-thread-1-processing-n:127.0.0.1:39299__pm) [n:127.0.0.1:39299__pm c:collection1   x:collection1] o.a.s.s.OpenExchangeRatesOrgProvider Reloading exchange rates from open-exchange-rates.json
   [junit4]   2> 1701193 WARN  (coreLoadExecutor-3671-thread-1-processing-n:127.0.0.1:39299__pm) [n:127.0.0.1:39299__pm c:collection1   x:collection1] o.a.s.s.OpenExchangeRatesOrgProvider Unknown key IMPORTANT NOTE
   [junit4]   2> 1701193 WARN  (coreLoadExecutor-3671-thread-1-processing-n:127.0.0.1:39299__pm) [n:127.0.0.1:39299__pm c:collection1   x:collection1] o.a.s.s.OpenExchangeRatesOrgProvider Expected key, got STRING
   [junit4]   2> 1701193 INFO  (coreLoadExecutor-3671-thread-1-processing-n:127.0.0.1:39299__pm) [n:127.0.0.1:39299__pm c:collection1   x:collection1] o.a.s.s.OpenExchangeRatesOrgProvider Reloading exchange rates from open-exchange-rates.json
   [junit4]   2> 1701194 WARN  (coreLoadExecutor-3671-thread-1-processing-n:127.0.0.1:39299__pm) [n:127.0.0.1:39299__pm c:collection1   x:collection1] o.a.s.s.OpenExchangeRatesOrgProvider Unknown key IMPORTANT NOTE
   [junit4]   2> 1701194 WARN  (coreLoadExecutor-3671-thread-1-processing-n:127.0.0.1:39299__pm) [n:127.0.0.1:39299__pm c:collection1   x:collection1] o.a.s.s.OpenExchangeRatesOrgProvider Expected key, got STRING
   [junit4]   2> 1701196 INFO  (coreLoadExecutor-3671-thread-1-processing-n:127.0.0.1:39299__pm) [n:127.0.0.1:39299__pm c:collection1   x:collection1] o.a.s.c.ConfigSetProperties Did not find ConfigSet properties, assuming default properties: Can't find resource 'configsetprops.json' in classpath or '/configs/conf1', cwd=/x1/jenkins/jenkins-slave/workspace/Lucene-Solr-NightlyTests-5.4/solr/build/solr-core/test/J0
   [junit4]   2> 1701196 INFO  (coreLoadExecutor-3671-thread-1-processing-n:127.0.0.1:39299__pm) [n:127.0.0.1:39299__pm c:collection1   x:collection1] o.a.s.c.CoreContainer Creating SolrCore 'collection1' using configuration from collection collection1
   [junit4]   2> 1701196 INFO  (coreLoadExecutor-3671-thread-1-processing-n:127.0.0.1:39299__pm) [n:127.0.0.1:39299__pm c:collection1 s:shard2 r:core_node1 x:collection1] o.a.s.c.SolrCore org.apache.solr.core.MockDirectoryFactory
   [junit4]   2> 1701196 INFO  (coreLoadExecutor-3671-thread-1-processing-n:127.0.0.1:39299__pm) [n:127.0.0.1:39299__pm c:collection1 s:shard2 r:core_node1 x:collection1] o.a.s.c.SolrCore [[collection1] ] Opening new SolrCore at [/x1/jenkins/jenkins-slave/workspace/Lucene-Solr-NightlyTests-5.4/solr/build/solr-core/test/J0/temp/solr.cloud.CollectionsAPIDistributedZkTest_EB19EDDE5315287C-001/shard-1-001/cores/collection1], dataDir=[null]
   [junit4]   2> 1701196 INFO  (coreLoadExecutor-3671-thread-1-processing-n:127.0.0.1:39299__pm) [n:127.0.0.1:39299__pm c:collection1 s:shard2 r:core_node1 x:collection1] o.a.s.c.JmxMonitoredMap JMX monitoring is enabled. Adding Solr mbeans to JMX Server: com.sun.jmx.mbeanserver.JmxMBeanServer@189b7091
   [junit4]   2> 1701197 INFO  (coreLoadExecutor-3671-thread-1-processing-n:127.0.0.1:39299__pm) [n:127.0.0.1:39299__pm c:collection1 s:shard2 r:core_node1 x:collection1] o.a.s.c.CachingDirectoryFactory return new directory for /x1/jenkins/jenkins-slave/workspace/Lucene-Solr-NightlyTests-5.4/solr/build/solr-core/test/J0/temp/solr.cloud.CollectionsAPIDistributedZkTest_EB19EDDE5315287C-001/shard-1-001/cores/collection1/data
   [junit4]   2> 1701197 INFO  (coreLoadExecutor-3671-thread-1-processing-n:127.0.0.1:39299__pm) [n:127.0.0.1:39299__pm c:collection1 s:shard2 r:core_node1 x:collection1] o.a.s.c.SolrCore New index directory detected: old=null new=/x1/jenkins/jenkins-slave/workspace/Lucene-Solr-NightlyTests-5.4/solr/build/solr-core/test/J0/temp/solr.cloud.CollectionsAPIDistributedZkTest_EB19EDDE5315287C-001/shard-1-001/cores/collection1/data/index/
   [junit4]   2> 1701197 WARN  (coreLoadExecutor-3671-thread-1-processing-n:127.0.0.1:39299__pm) [n:127.0.0.1:39299__pm c:collection1 s:shard2 r:core_node1 x:collection1] o.a.s.c.SolrCore [collection1] Solr index directory '/x1/jenkins/jenkins-slave/workspace/Lucene-Solr-NightlyTests-5.4/solr/build/solr-core/test/J0/temp/solr.cloud.CollectionsAPIDistributedZkTest_EB19EDDE5315287C-001/shard-1-001/cores/collection1/data/index' doesn't exist. Creating new index...
   [junit4]   2> 1701197 INFO  (coreLoadExecutor-3671-thread-1-processing-n:127.0.0.1:39299__pm) [n:127.0.0.1:39299__pm c:collection

[...truncated too long message...]

TGRP-CollectionsAPIDistributedZkTest]
   [junit4]    > Caused by: org.apache.solr.client.solrj.impl.HttpSolrClient$RemoteSolrException: Error from server at http://127.0.0.1:45927/_pm: collection already exists: awholynewstresscollection_collection5_0
   [junit4]    > 	at __randomizedtesting.SeedInfo.seed([EB19EDDE5315287C]:0)
   [junit4]    > 	at org.apache.solr.client.solrj.impl.HttpSolrClient.executeMethod(HttpSolrClient.java:575)
   [junit4]    > 	at org.apache.solr.client.solrj.impl.HttpSolrClient.request(HttpSolrClient.java:241)
   [junit4]    > 	at org.apache.solr.client.solrj.impl.HttpSolrClient.request(HttpSolrClient.java:230)
   [junit4]    > 	at org.apache.solr.client.solrj.impl.LBHttpSolrClient.doRequest(LBHttpSolrClient.java:372)
   [junit4]    > 	at org.apache.solr.client.solrj.impl.LBHttpSolrClient.request(LBHttpSolrClient.java:325)
   [junit4]    > 	at org.apache.solr.client.solrj.impl.CloudSolrClient.sendRequest(CloudSolrClient.java:1100)
   [junit4]    > 	at org.apache.solr.client.solrj.impl.CloudSolrClient.requestWithRetryOnStaleState(CloudSolrClient.java:871)
   [junit4]    > 	at org.apache.solr.client.solrj.impl.CloudSolrClient.request(CloudSolrClient.java:807)
   [junit4]    > 	at org.apache.solr.client.solrj.SolrClient.request(SolrClient.java:1220)
   [junit4]    > 	at org.apache.solr.cloud.AbstractFullDistribZkTestBase.createCollection(AbstractFullDistribZkTestBase.java:1574)
   [junit4]    > 	at org.apache.solr.cloud.AbstractFullDistribZkTestBase.createCollection(AbstractFullDistribZkTestBase.java:1595)
   [junit4]    > 	at org.apache.solr.cloud.CollectionsAPIDistributedZkTest$1CollectionThread.run(CollectionsAPIDistributedZkTest.java:881)Throwable #5: com.carrotsearch.randomizedtesting.UncaughtExceptionError: Captured an uncaught exception in thread: Thread[id=59604, name=collection0, state=RUNNABLE, group=TGRP-CollectionsAPIDistributedZkTest]
   [junit4]    > Caused by: org.apache.solr.client.solrj.impl.HttpSolrClient$RemoteSolrException: Error from server at http://127.0.0.1:56037/_pm: collection already exists: awholynewstresscollection_collection0_0
   [junit4]    > 	at __randomizedtesting.SeedInfo.seed([EB19EDDE5315287C]:0)
   [junit4]    > 	at org.apache.solr.client.solrj.impl.HttpSolrClient.executeMethod(HttpSolrClient.java:575)
   [junit4]    > 	at org.apache.solr.client.solrj.impl.HttpSolrClient.request(HttpSolrClient.java:241)
   [junit4]    > 	at org.apache.solr.client.solrj.impl.HttpSolrClient.request(HttpSolrClient.java:230)
   [junit4]    > 	at org.apache.solr.client.solrj.impl.LBHttpSolrClient.doRequest(LBHttpSolrClient.java:372)
   [junit4]    > 	at org.apache.solr.client.solrj.impl.LBHttpSolrClient.request(LBHttpSolrClient.java:325)
   [junit4]    > 	at org.apache.solr.client.solrj.impl.CloudSolrClient.sendRequest(CloudSolrClient.java:1100)
   [junit4]    > 	at org.apache.solr.client.solrj.impl.CloudSolrClient.requestWithRetryOnStaleState(CloudSolrClient.java:871)
   [junit4]    > 	at org.apache.solr.client.solrj.impl.CloudSolrClient.request(CloudSolrClient.java:807)
   [junit4]    > 	at org.apache.solr.client.solrj.SolrClient.request(SolrClient.java:1220)
   [junit4]    > 	at org.apache.solr.cloud.AbstractFullDistribZkTestBase.createCollection(AbstractFullDistribZkTestBase.java:1574)
   [junit4]    > 	at org.apache.solr.cloud.AbstractFullDistribZkTestBase.createCollection(AbstractFullDistribZkTestBase.java:1595)
   [junit4]    > 	at org.apache.solr.cloud.CollectionsAPIDistributedZkTest$1CollectionThread.run(CollectionsAPIDistributedZkTest.java:881)Throwable #6: com.carrotsearch.randomizedtesting.UncaughtExceptionError: Captured an uncaught exception in thread: Thread[id=59606, name=collection2, state=RUNNABLE, group=TGRP-CollectionsAPIDistributedZkTest]
   [junit4]    > Caused by: org.apache.solr.client.solrj.impl.HttpSolrClient$RemoteSolrException: Error from server at http://127.0.0.1:56037/_pm: Could not find collection : awholynewstresscollection_collection2_0
   [junit4]    > 	at __randomizedtesting.SeedInfo.seed([EB19EDDE5315287C]:0)
   [junit4]    > 	at org.apache.solr.client.solrj.impl.HttpSolrClient.executeMethod(HttpSolrClient.java:575)
   [junit4]    > 	at org.apache.solr.client.solrj.impl.HttpSolrClient.request(HttpSolrClient.java:241)
   [junit4]    > 	at org.apache.solr.client.solrj.impl.HttpSolrClient.request(HttpSolrClient.java:230)
   [junit4]    > 	at org.apache.solr.client.solrj.impl.LBHttpSolrClient.doRequest(LBHttpSolrClient.java:372)
   [junit4]    > 	at org.apache.solr.client.solrj.impl.LBHttpSolrClient.request(LBHttpSolrClient.java:325)
   [junit4]    > 	at org.apache.solr.client.solrj.impl.CloudSolrClient.sendRequest(CloudSolrClient.java:1100)
   [junit4]    > 	at org.apache.solr.client.solrj.impl.CloudSolrClient.requestWithRetryOnStaleState(CloudSolrClient.java:871)
   [junit4]    > 	at org.apache.solr.client.solrj.impl.CloudSolrClient.request(CloudSolrClient.java:807)
   [junit4]    > 	at org.apache.solr.client.solrj.SolrClient.request(SolrClient.java:1220)
   [junit4]    > 	at org.apache.solr.cloud.CollectionsAPIDistributedZkTest$1CollectionThread.run(CollectionsAPIDistributedZkTest.java:888)
   [junit4]   2> 2133018 INFO  (SUITE-CollectionsAPIDistributedZkTest-seed#[EB19EDDE5315287C]-worker) [n:127.0.0.1:45927__pm c:awholynewstresscollection_collection0_0 s:shard5 r:core_node8 x:awholynewstresscollection_collection0_0_shard5_replica2] o.a.s.SolrTestCaseJ4 ###deleteCore
   [junit4]   2> Dec 08, 2015 11:00:34 AM com.carrotsearch.randomizedtesting.ThreadLeakControl checkThreadLeaks
   [junit4]   2> WARNING: Will linger awaiting termination of 1 leaked thread(s).
   [junit4]   2> NOTE: test params are: codec=Asserting(Lucene54): {range_facet_i_dv=FSTOrd50, intDefault=FSTOrd50, range_facet_l=FSTOrd50, a_i1=FSTOrd50, timestamp=FSTOrd50, _version_=FSTOrd50, text=PostingsFormat(name=Direct), other_tl1=FSTOrd50, multiDefault=PostingsFormat(name=Asserting), a_t=FSTOrd50, range_facet_l_dv=FST50, id=FST50}, docValues:{range_facet_i_dv=DocValuesFormat(name=Memory), timestamp=DocValuesFormat(name=Memory), range_facet_l_dv=DocValuesFormat(name=Lucene54)}, sim=DefaultSimilarity, locale=lv, timezone=Asia/Harbin
   [junit4]   2> NOTE: Linux 3.13.0-52-generic amd64/Oracle Corporation 1.7.0_80 (64-bit)/cpus=4,threads=1,free=72306112,total=469762048
   [junit4]   2> NOTE: All tests run in this JVM: [TestAtomicUpdateErrorCases, TestJsonFacets, TestPKIAuthenticationPlugin, URLClassifyProcessorTest, LeaderElectionIntegrationTest, ConnectionManagerTest, TestOmitPositions, TestFieldSortValues, AnalyticsMergeStrategyTest, DistributedQueryElevationComponentTest, DeleteLastCustomShardedReplicaTest, SolrCloudExampleTest, TestInitParams, TestRTGBase, EchoParamsTest, TestBadConfig, HttpPartitionTest, TestMacros, TestManagedSchema, JSONWriterTest, TestComponentsName, SOLR749Test, TestSimpleTrackingShardHandler, TestLMDirichletSimilarityFactory, TestCSVLoader, SystemInfoHandlerTest, SolrRequestParserTest, AsyncMigrateRouteKeyTest, TestShortCircuitedRequests, TestLRUCache, ReturnFieldsTest, TestRandomMergePolicy, TestMinMaxOnMultiValuedField, TestCursorMarkWithoutUniqueKey, ZkStateWriterTest, TestPseudoReturnFields, IndexSchemaRuntimeFieldTest, DeleteShardTest, TestConfigReload, QueryEqualityTest, QueryElevationComponentTest, TestCustomDocTransformer, TestReqParamsAPI, TestExceedMaxTermLength, DistributedDebugComponentTest, SignatureUpdateProcessorFactoryTest, XsltUpdateRequestHandlerTest, CollectionReloadTest, TestLazyCores, BasicAuthIntegrationTest, TestSchemaManager, HdfsLockFactoryTest, PeerSyncTest, TestFunctionQuery, CacheHeaderTest, TestIBSimilarityFactory, EnumFieldTest, ExternalFileFieldSortTest, TestDistributedSearch, DistributedSuggestComponentTest, TestSmileRequest, CachingDirectoryFactoryTest, VMParamsZkACLAndCredentialsProvidersTest, ConfigSetsAPITest, SegmentsInfoRequestHandlerTest, TestSchemaSimilarityResource, TestCollectionAPI, DeleteInactiveReplicaTest, CurrencyFieldOpenExchangeTest, AnalysisAfterCoreReloadTest, ReplicationFactorTest, DistributedQueueTest, TestConfigSets, HLLUtilTest, TestShardHandlerFactory, TestCustomSort, JavabinLoaderTest, TestRemoteStreaming, TestNamedUpdateProcessors, TestRecoveryHdfs, TestRawResponseWriter, TestConfigSetsAPIExclusivity, UUIDFieldTest, HdfsWriteToMultipleCollectionsTest, TestDynamicLoading, AnalysisErrorHandlingTest, PreAnalyzedFieldTest, TestRTimerTree, TestBinaryField, ResourceLoaderTest, BasicDistributedZkTest, UnloadDistributedZkTest, CollectionsAPIDistributedZkTest]
   [junit4] Completed [225/551] on J0 in 437.69s, 1 test, 1 error <<< FAILURES!

[...truncated 1043 lines...]
BUILD FAILED
/x1/jenkins/jenkins-slave/workspace/Lucene-Solr-NightlyTests-5.4/build.xml:799: The following error occurred while executing this line:
/x1/jenkins/jenkins-slave/workspace/Lucene-Solr-NightlyTests-5.4/build.xml:736: The following error occurred while executing this line:
/x1/jenkins/jenkins-slave/workspace/Lucene-Solr-NightlyTests-5.4/build.xml:59: The following error occurred while executing this line:
/x1/jenkins/jenkins-slave/workspace/Lucene-Solr-NightlyTests-5.4/solr/build.xml:233: The following error occurred while executing this line:
/x1/jenkins/jenkins-slave/workspace/Lucene-Solr-NightlyTests-5.4/solr/common-build.xml:526: The following error occurred while executing this line:
/x1/jenkins/jenkins-slave/workspace/Lucene-Solr-NightlyTests-5.4/lucene/common-build.xml:1452: The following error occurred while executing this line:
/x1/jenkins/jenkins-slave/workspace/Lucene-Solr-NightlyTests-5.4/lucene/common-build.xml:1006: There were test failures: 551 suites (7 ignored), 2177 tests, 1 error, 32 ignored (18 assumptions) [seed: EB19EDDE5315287C]

Total time: 209 minutes 5 seconds
Build step 'Invoke Ant' marked build as failure
Archiving artifacts
No prior successful build to compare, so performing full copy of artifacts
Recording test results
Email was triggered for: Failure - Any
Sending email for trigger: Failure - Any



Mime
View raw message